Tridecanoic acid
- Formula: C13H26O2
- Molecular weight: 214.3443
- IUPAC Standard InChIKey: SZHOJFHSIKHZHA-UHFFFAOYSA-N
- CAS Registry Number: 638-53-9
- Chemical structure:
View 3d structure (requires JavaScript / HTML 5) - Other names: n-Tridecanoic acid; n-Tridecoic acid; Tridecylic acid

Condensed phase thermochemistry data

Data compiled as indicated in comments:
ALS - Hussein Y. Afeefy, Joel F. Liebman, and Stephen E. Stein
DH - Eugene S. Domalski and Elizabeth D. Hearing
Quantity | Value | Units | Method | Reference | Comment |
---|---|---|---|---|---|
ΔcH°liquid | -8024.2 ± 1.3 | kJ/mol | Ccb | Adriaanse, Dekker, et al., 1965 | Hfusion=43.1 kJ/mol; Corresponding ΔfHºliquid = -807.2 kJ/mol (simple calculation by NIST; no Washburn corrections); ALS |
Constant pressure heat capacity of solid
Cp,solid (J/mol*K) | Temperature (K) | Reference | Comment |
---|---|---|---|
387.6 | 298.15 | Schaake, van Miltenburg, et al., 1982 | T = 80 to 340 K.; DH |

Phase change data

Data compiled as indicated in comments:
BS - Robert L. Brown and Stephen E. Stein
TRC - Thermodynamics Research Center, NIST Boulder Laboratories, Chris Muzny director
AC - William E. Acree, Jr., James S. Chickos
ALS - Hussein Y. Afeefy, Joel F. Liebman, and Stephen E. Stein
CAL - James S. Chickos, William E. Acree, Jr., Joel F. Liebman, Students of Chem 202 (Introduction to the Literature of Chemistry), University of Missouri -- St. Louis
DH - Eugene S. Domalski and Elizabeth D. Hearing
Quantity | Value | Units | Method | Reference | Comment |
---|---|---|---|---|---|
Tfus | 314.95 | K | N/A | Gaikwad and Subrahmanyam, 1985 | Uncertainty assigned by TRC = 0.35 K; TRC |
Tfus | 315.1 | K | N/A | Adriaanse, Dekker, et al., 1964 | Uncertainty assigned by TRC = 0.05 K; TRC |
Tfus | 314.65 | K | N/A | Kimura, Takahashi, et al., 1958 | Uncertainty assigned by TRC = 2. K; TRC |
Tfus | 313.7 | K | N/A | Krafft, 1882 | Uncertainty assigned by TRC = 3. K; TRC |
Quantity | Value | Units | Method | Reference | Comment |
Ttriple | 315.01 | K | N/A | Schaake, van Miltenburg, et al., 1982, 2 | Crystal phase 1 phase; Uncertainty assigned by TRC = 0.02 K; TRC |
Quantity | Value | Units | Method | Reference | Comment |
Tc | 754.01 | K | N/A | D'Souza and Teja, 1987 | Uncertainty assigned by TRC = 3. K; Ambrose's procedure; TRC |
Quantity | Value | Units | Method | Reference | Comment |
Pc | 17.4888 | bar | N/A | D'Souza and Teja, 1987 | Uncertainty assigned by TRC = 0.85 bar; Ambrose's procedure; TRC |
Quantity | Value | Units | Method | Reference | Comment |
ΔsubH° | 141. | kJ/mol | V | Baccanari, Novinski, et al., 1968 | ALS |
Reduced pressure boiling point
Tboil (K) | Pressure (bar) | Reference | Comment |
---|---|---|---|
509.2 | 0.133 | Weast and Grasselli, 1989 | BS |
Enthalpy of vaporization
ΔvapH (kJ/mol) | Temperature (K) | Method | Reference | Comment |
---|---|---|---|---|
90.1 | 424. | A | Stephenson and Malanowski, 1987 | Based on data from 409. to 585. K.; AC |
100.4 ± 2.0 | 340. | ME,TE | de Kruif, Schaake, et al., 1982 | Based on data from 328. to 350. K.; AC |
Antoine Equation Parameters
log10(P) = A − (B / (T + C))
P = vapor pressure (bar)
T = temperature (K)
View plot Requires a JavaScript / HTML 5 canvas capable browser.
Temperature (K) | A | B | C | Reference | Comment |
---|---|---|---|---|---|
411.0 to 572. | 6.26516 | 3196.569 | -61.174 | Stull, 1947 | Coefficents calculated by NIST from author's data. |
Enthalpy of sublimation
ΔsubH (kJ/mol) | Temperature (K) | Method | Reference | Comment |
---|---|---|---|---|
112.5 | 271. to 282. | TPTD | Chattopadhyay and Ziemann, 2005 | AC |
170. | 282. to 299. | TPTD | Chattopadhyay, Tobias, et al., 2001 | Experimental values based on the TPTD method are often inconsistent with values determined using other experimental methods; AC |
Enthalpy of fusion
ΔfusH (kJ/mol) | Temperature (K) | Method | Reference | Comment |
---|---|---|---|---|
33.0 | 314.6 | DSC | Gbabode, Negrier, et al., 2007 | AC |
33.74 | 315. | N/A | Domalski and Hearing, 1996 | AC |
Entropy of fusion
ΔfusS (J/mol*K) | Temperature (K) | Reference | Comment |
---|---|---|---|
28.41 | 307.1 | Domalski and Hearing, 1996 | CAL |
107.11 | 315.0 |
Enthalpy of phase transition
ΔHtrs (kJ/mol) | Temperature (K) | Initial Phase | Final Phase | Reference | Comment |
---|---|---|---|---|---|
8.730 | 307.1 | crystaline, II | crystaline, I | Schaake, van Miltenburg, et al., 1982 | DH |
33.729 | 315.01 | crystaline, I | liquid | Schaake, van Miltenburg, et al., 1982 | DH |
Entropy of phase transition
ΔStrs (J/mol*K) | Temperature (K) | Initial Phase | Final Phase | Reference | Comment |
---|---|---|---|---|---|
28.41 | 307.1 | crystaline, II | crystaline, I | Schaake, van Miltenburg, et al., 1982 | DH |
107.07 | 315.01 | crystaline, I | liquid | Schaake, van Miltenburg, et al., 1982 | DH |

Kovats' RI, non-polar column, temperature ramp

View large format table.

Column type Active phase I Reference Comment
CapillaryBP-11666.Raina, Verma, et al., 200625. m/0.32 mm/0.25 μm, N2, 5. K/min, 220. C @ 13. min; Tstart: 60. C
CapillaryBP-11668.Srivastava, Srivastava, et al., 200630. m/0.32 mm/0.25 μm, N2, 5. K/min, 220. C @ 3. min; Tstart: 60. C
CapillaryBP-11659.Raina, Lal, et al., 200260. m/0.32 mm/0.25 μm, N2, 5. K/min; Tstart: 60. C; Tend: 220. C

Van Den Dool and Kratz RI, non-polar column, temperature ramp

View large format table.

Column type Active phase I Reference Comment
CapillaryHP-5MS1662.Benkaci-Ali, Baaliouamer, et al., 200730. m/0.25 mm/0.25 μm, He, 60. C @ 8. min, 2. K/min, 250. C @ 30. min
CapillaryHP-5MS1664.Zeng, Zhao, et al., 200730. m/0.25 mm/0.25 μm, He, 4. K/min; Tstart: 80. C; Tend: 300. C
CapillaryHP-5MS1678.Pino, Mesa, et al., 200530. m/0.25 mm/0.25 μm, He, 60. C @ 2. min, 4. K/min, 250. C @ 20. min
CapillaryHP-51662.Lazari, Skaltsa, et al., 200030. m/0.25 mm/0.25 μm, He, 50. C @ 5. min, 4. K/min; Tend: 280. C

Van Den Dool and Kratz RI, non-polar column, custom temperature program

View large format table.

Column type Active phase I Reference Comment
CapillaryVF-5MS1667.2Tret'yakov, 200830. m/0.25 mm/0.25 μm, He; Program: Multi-step temperature program; T(initial)=60C; T(final)=270C

Van Den Dool and Kratz RI, polar column, temperature ramp

View large format table.

Column type Active phase I Reference Comment
CapillaryAT-Wax2573.Pino, Almora, et al., 200360. m/0.32 mm/0.25 μm, He, 65. C @ 10. min, 2. K/min, 250. C @ 60. min
CapillaryDB-Wax2603.Shiratsuchi, Shimoda, et al., 199460. m/0.25 mm/0.25 μm, He, 2. K/min, 230. C @ 60. min; Tstart: 50. C

Normal alkane RI, non-polar column, temperature ramp

View large format table.

Column type Active phase I Reference Comment
CapillaryHP-11651.Wetwiayaklung, Thavanapong, et al., 200925. m/0.32 mm/0.17 μm, 50. C @ 5. min, 1. K/min, 260. C @ 5. min
CapillaryPE-51680.Pandey-Rai S., Mallavarapu G.R., et al., 200650. m/0.32 mm/0.25 μm, He, 100. C @ 1. min, 3. K/min; Tend: 280. C
CapillaryOptima-11660.Brun, Bessière, et al., 200125. m/0.20 mm/0.25 μm, He, 50. C @ 3. min, 3. K/min; Tend: 250. C
CapillaryOptima-11668.de Beck, Bessière, et al., 200025. m/0.20 mm/0.25 μm, He, 50. C @ 3. min, 3. K/min; Tend: 250. C
CapillaryCross-Linked Methylsilicone1648.Bravo and Hotchkiss, 1993He, 35. C @ 3. min, 4. K/min; Column length: 25. m; Column diameter: 0.32 mm; Tend: 225. C
CapillaryUltra-11669.Okumura, 199125. m/0.32 mm/0.25 μm, He, 3. K/min; Tstart: 80. C; Tend: 260. C

Normal alkane RI, non-polar column, custom temperature program

View large format table.

Column type Active phase I Reference Comment
CapillaryHP-11647.Wetwiayaklung, Thavanapong, et al., 200925. m/0.32 mm/0.17 μm; Program: not specified
CapillaryCP Sil 5 CB1645.Weyerstahl, Marschall, et al., 1998N2; Column length: 25. m; Phase thickness: 0.39 μm; Program: not specified

Normal alkane RI, polar column, temperature ramp

View large format table.

Column type Active phase I Reference Comment
CapillaryTC-FFAP2651.Kurose and Yatagai, 200560. m/0.25 mm/0.4 μm, He, 3. K/min, 220. C @ 30. min; Tstart: 60. C
CapillaryDB-Wax2570.Hatsuko, Kazuko, et al., 1992He, 60. C @ 10. min, 3. K/min; Column length: 30. m; Column diameter: 0.25 mm; Tend: 240. C
CapillarySupelcowax-102664.Miranda-López, Libbey, et al., 199260. m/0.75 mm/1. μm, 80. C @ 5. min, 2. K/min; Tend: 200. C

Normal alkane RI, polar column, custom temperature program

View large format table.

Column type Active phase I Reference Comment
CapillaryHP Innowax FSP2617.Tabanca N., Demirci B., et al., 200760. m/0.25 mm/0.25 μm, N2; Program: 60C(10min) => 4C/min => 220C(10min) => 1C/min => 240C
CapillaryInnowax FSC2617.Baser, Özek, et al., 200660. m/0.25 mm/0.25 μm, He; Program: 60C(10min) => 4C/min >220C (10min) => 1C/min => 240C
CapillaryHP Innowax FSP2617.Altintas, Kose, et al., 200460. m/0.25 mm/0.25 μm, N2; Program: 60C(10min) => 4C/min => 220C(10min) => 1C/min => 240C
CapillaryInnowax FSC2617.Kirimer, Tabanca, et al., 200060. m/0.25 mm/0.25 μm, He; Program: 60C(10 min) => 4C/min => 220C(10min) => 1C/min => 240C

Lee's RI, non-polar column, temperature ramp

View large format table.

Column type Active phase I Reference Comment
CapillaryDB-5MS278.19Chen, Keeran, et al., 200230. m/0.25 mm/0.5 μm, 40. C @ 1. min, 10. K/min; Tend: 310. C
CapillaryDB-5277.6Donnelly, Abdel-Hamid, et al., 199330. m/0.32 mm/0.25 μm, He, 40. C @ 3. min, 8. K/min, 285. C @ 29.5 min

References

Adriaanse, Dekker, et al., 1965
Adriaanse, N.; Dekker, H.; Coops, J.,
Heats of combustion of normal saturated fatty acids and their methyl esters,
Rec. Trav. Chim. Pays/Bas, 1965, 84, 393-407. [all data]
Schaake, van Miltenburg, et al., 1982
Schaake, R.C.F.; van Miltenburg, J.C.; De Kruif, C.G.,
Thermodynamic properties of the normal alkanoic acids. I. Molar heat capacities of seven odd-numbered normal alkanoic acids,
J. Chem. Thermodynam., 1982, 14, 763-769. [all data]
Gaikwad and Subrahmanyam, 1985
Gaikwad, B.R.; Subrahmanyam, V.V.,
Melting behavior of fatty alcohols and their binary blends.,
J. Indian Chem. Soc., 1985, 62, 513. [all data]
Adriaanse, Dekker, et al., 1964
Adriaanse, N.; Dekker, H.; Coops, J.,
Some Physical Constants of Normal, Saturated Fatty Acids and Their Methyl Esters,
Recl. Trav. Chim. Pays-Bas, 1964, 83, 557. [all data]
Kimura, Takahashi, et al., 1958
Kimura, K.; Takahashi, M.; Tanaka, A.,
Anodic Synthesis of Fatty Acids III.,
Yakugaku Zasshi, 1958, 78, 802. [all data]
Krafft, 1882
Krafft, F.,
On Nineteen Higher Normal Paraffins and a Simple Volume Law for Liquids that form Drops I.,
Ber. Dtsch. Chem. Ges., 1882, 15, 1687-711. [all data]
Schaake, van Miltenburg, et al., 1982, 2
Schaake, R.C.F.; van Miltenburg, J.C.; De Kruif, C.G.,
Thermodynamic properties of the normal alkanoic acids. I. Molar heat capacities of seven odd-numbered normal alkanoic acids.,
J. Chem. Thermodyn., 1982, 14, 763. [all data]
D'Souza and Teja, 1987
D'Souza, R.; Teja, A.S.,
The prediction of the vapor pressures of carboxylic acids,
Chem. Eng. Commun., 1987, 61, 13. [all data]
Baccanari, Novinski, et al., 1968
Baccanari, D.P.; Novinski, J.A.; Pan, Y.; Yevitz, M.M.; Swain, H.A., Jr.,
Heats of sublimation and vaporization at 25° of long chain fatty acids and methyl esters,
Trans. Faraday Soc., 1968, 64, 1201. [all data]
Weast and Grasselli, 1989
CRC Handbook of Data on Organic Compounds, 2nd Editon, Weast,R.C and Grasselli, J.G., ed(s)., CRC Press, Inc., Boca Raton, FL, 1989, 1. [all data]
Stephenson and Malanowski, 1987
Stephenson, Richard M.; Malanowski, Stanislaw,
Handbook of the Thermodynamics of Organic Compounds, 1987, https://doi.org/10.1007/978-94-009-3173-2
. [all data]
de Kruif, Schaake, et al., 1982
de Kruif, C.G.; Schaake, R.C.F.; van Miltenburg, J.C.; van der Klauw, K.; Blok, J.G.,
Thermodynamic properties of the normal alkanoic acids III. Enthalpies of vaporization and vapour pressures of 13 normal alkanoic acids,
The Journal of Chemical Thermodynamics, 1982, 14, 8, 791-798, https://doi.org/10.1016/0021-9614(82)90176-8
. [all data]
Stull, 1947
Stull, Daniel R.,
Vapor Pressure of Pure Substances. Organic and Inorganic Compounds,
Ind. Eng. Chem., 1947, 39, 4, 517-540, https://doi.org/10.1021/ie50448a022
. [all data]
Chattopadhyay and Ziemann, 2005
Chattopadhyay, Sulekha; Ziemann, Paul J.,
Vapor Pressures of Substituted and Unsubstituted Monocarboxylic and Dicarboxylic Acids Measured Using an Improved Thermal Desorption Particle Beam Mass Spectrometry Method,
Aerosol Science and Technology, 2005, 39, 11, 1085-1100, https://doi.org/10.1080/02786820500421547
. [all data]
Chattopadhyay, Tobias, et al., 2001
Chattopadhyay, Sulekha; Tobias, Herbert J.; Ziemann, Paul J.,
A Method for Measuring Vapor Pressures of Low-Volatility Organic Aerosol Compounds Using a Thermal Desorption Particle Beam Mass Spectrometer,
Anal. Chem., 2001, 73, 16, 3797-3803, https://doi.org/10.1021/ac010304j
. [all data]
Gbabode, Negrier, et al., 2007
Gbabode, Gabin; Negrier, Philippe; Mondieig, Denise; Moreno Calvo, Evelyn; Calvet, Teresa; Cuevas-Diarte, Miquel Àngel,
Structures of the High-Temperature Solid Phases of the Odd-Numbered Fatty Acids from Tridecanoic Acid to Tricosanoic Acid,
Chem. Eur. J., 2007, 13, 11, 3150-3159, https://doi.org/10.1002/chem.200600955
. [all data]
Domalski and Hearing, 1996
Domalski, Eugene S.; Hearing, Elizabeth D.,
Heat Capacities and Entropies of Organic Compounds in the Condensed Phase. Volume III,
J. Phys. Chem. Ref. Data, 1996, 25, 1, 1, https://doi.org/10.1063/1.555985
. [all data]