Butane, 1-(ethylthio)-
- Formula: C6H14S
- Molecular weight: 118.240
- IUPAC Standard InChIKey: XJIRSLHMKBUGMR-UHFFFAOYSA-N
- CAS Registry Number: 638-46-0
- Chemical structure:
View 3d structure (requires JavaScript / HTML 5) - Other names: Sulfide, butyl ethyl; Butyl ethyl sulfide; Ethyl butyl sulfide; 3-Thiaheptane; 1-(Ethylthio)butane; Ethyl butyl sulphide; Ethyl n-butyl sulfide; n-Butylethylsulfide

Gas phase thermochemistry data

Data compiled by: Hussein Y. Afeefy, Joel F. Liebman, and Stephen E. Stein
Quantity | Value | Units | Method | Reference | Comment |
---|---|---|---|---|---|
ΔfH°gas | -127. ± 3. | kJ/mol | Ccb | Mackle and Mayrick, 1962 |

Condensed phase thermochemistry data

Data compiled by: Hussein Y. Afeefy, Joel F. Liebman, and Stephen E. Stein
Quantity | Value | Units | Method | Reference | Comment |
---|---|---|---|---|---|
ΔfH°liquid | -172. ± 2. | kJ/mol | Ccb | Mackle and Mayrick, 1962 | |
Quantity | Value | Units | Method | Reference | Comment |
ΔcH°liquid | -4791.8 ± 1.9 | kJ/mol | Ccb | Mackle and Mayrick, 1962 |

Phase change data

Data compiled as indicated in comments:
BS - Robert L. Brown and Stephen E. Stein
TRC - Thermodynamics Research Center, NIST Boulder Laboratories, Chris Muzny director
AC - William E. Acree, Jr., James S. Chickos
ALS - Hussein Y. Afeefy, Joel F. Liebman, and Stephen E. Stein
DRB - Donald R. Burgess, Jr.
Quantity | Value | Units | Method | Reference | Comment |
---|---|---|---|---|---|
Tboil | 417.4 | K | N/A | Weast and Grasselli, 1989 | BS |
Tboil | 417. | K | N/A | American Tokyo Kasei, 1988 | BS |
Tboil | 417.6 | K | N/A | Mcallan, Cullum, et al., 1951 | Uncertainty assigned by TRC = 0.4 K; TRC |
Quantity | Value | Units | Method | Reference | Comment |
Tfus | 178.02 | K | N/A | Mcallan, Cullum, et al., 1951 | Uncertainty assigned by TRC = 0.1 K; TRC |
Quantity | Value | Units | Method | Reference | Comment |
ΔvapH° | 44.5 | kJ/mol | N/A | Shimizu, Saito, et al., 1981 | AC |
ΔvapH° | 44.9 | kJ/mol | N/A | Reid, 1972 | AC |
ΔvapH° | 44.6 ± 0.8 | kJ/mol | GC | Mackle and McClean, 1964 | AC |
ΔvapH° | 45. ± 1. | kJ/mol | V | Mackle and Mayrick, 1962 | ALS |
ΔvapH° | 45.0 | kJ/mol | N/A | Mackle and Mayrick, 1962 | DRB |
Enthalpy of vaporization
ΔvapH (kJ/mol) | Temperature (K) | Method | Reference | Comment |
---|---|---|---|---|
43.7 | 319. | N/A | Dykyj, Svoboda, et al., 1999 | Based on data from 314. to 445. K.; AC |
40.7 | 369. | A,EB | Stephenson and Malanowski, 1987 | Based on data from 354. to 424. K. See also White, Barnard--Smith, et al., 1952.; AC |
43.5 | 333. | EB | Mackle and Mayrick, 1962, 2 | Based on data from 316. to 348. K.; AC |
Enthalpy of fusion
ΔfusH (kJ/mol) | Temperature (K) | Reference | Comment |
---|---|---|---|
12.39 | 178.1 | Lange, 1985 | AC |

Kovats' RI, non-polar column, isothermal

Column type | Active phase | Temperature (C) | I | Reference | Comment |
---|---|---|---|---|---|
Packed | Apiezon M | 130. | 893. | Garbuzov, Misharina, et al., 1985 | He or N2, Chromosorb W, AW-DMCS; Column length: 2.1 m |
Packed | Apiezon M | 130. | 893. | Golovnya, Garbuzov, et al., 1976 | N2, Chromosorb W; Column length: 2.1 m |
Packed | Apiezon M | 130. | 893. | Golovnya and Garbuzov, 1974 | N2, Chromosorb W; Column length: 2.1 m |
Packed | Apiezon L | 110. | 896. | Martinu and Janák, 1970 | |
Packed | Apiezon L | 130. | 901. | Martinu and Janák, 1970 | |
Packed | Apiezon L | 150. | 906. | Martinu and Janák, 1970 |

Kovats' RI, polar column, isothermal

Column type | Active phase | Temperature (C) | I | Reference | Comment |
---|---|---|---|---|---|
Capillary | PEG-20M | 93. | 1096.1 | Morishita, Murakita, et al., 1985 | Column length: 50. m; Column diameter: 0.25 mm |
Capillary | PEG-20M | 80. | 1091.1 | Morishita, Murakita, et al., 1982 | N2; Column length: 50. m; Column diameter: 0.25 mm |
Packed | Polyethylene Glycol | 130. | 1113. | Golovnya, Garbuzov, et al., 1976 | N2, Chromosorb W; Column length: 2.1 m |

Normal alkane RI, non-polar column, temperature ramp

Column type | Active phase | I | Reference | Comment |
---|---|---|---|---|
Capillary | DB-5 | 892. | Savel'eva, Zenkevich, et al., 2003 | 25. m/0.20 mm/0.33 μm, Helium, 40. C @ 1. min, 5. K/min, 270. C @ 15. min |

Normal alkane RI, non-polar column, custom temperature program

Column type | Active phase | I | Reference | Comment |
---|---|---|---|---|
Capillary | SE-30 | 893. | Vinogradov, 2004 | Program: not specified |

Normal alkane RI, polar column, custom temperature program

Column type | Active phase | I | Reference | Comment |
---|---|---|---|---|
Capillary | Carbowax 20M | 1090. | Vinogradov, 2004 | Program: not specified |

References

Mackle and Mayrick, 1962
Mackle, H.; Mayrick, R.G.,
Studies in the thermochemistry of organic sulphides. Part 2. The gas-phase heats of formation of ten aliphatic sulphides,
Trans. Faraday Soc., 1962, 58, 230-237. [all data]
Weast and Grasselli, 1989
CRC Handbook of Data on Organic Compounds, 2nd Editon, Weast,R.C and Grasselli, J.G., ed(s)., CRC Press, Inc., Boca Raton, FL, 1989, 1. [all data]
American Tokyo Kasei, 1988
American Tokyo Kasei,
TCI American Organic Chemical 88/89 Catalog, American Tokyo Kasei, Portland, OR, 1988, 1610. [all data]
Mcallan, Cullum, et al., 1951
Mcallan, D.T.; Cullum, T.V.; Dean, R.A.; Fidler, F.A.,
The Preparation and Properties of Sulfur Compounds Related to Petroleum I. The Dialkyl Sulfides and Disulfides,
J. Am. Chem. Soc., 1951, 73, 3627-32. [all data]
Shimizu, Saito, et al., 1981
Shimizu, M.; Saito, Y.; Kusano, K.,
, Preprints 17th Conf. Chem. Thermodyn. Thermal Anal., Japan, 1981, 50. [all data]
Reid, 1972
Reid, Robert C.,
Handbook on vapor pressure and heats of vaporization of hydrocarbons and related compounds, R. C. Wilhort and B. J. Zwolinski, Texas A Research Foundation. College Station, Texas(1971). 329 pages.$10.00,
AIChE J., 1972, 18, 6, 1278-1278, https://doi.org/10.1002/aic.690180637
. [all data]
Mackle and McClean, 1964
Mackle, H.; McClean, R.T.B.,
Measurement of vaporization heats by the method of gas-liquid chromatography. Part 2,
Trans. Faraday Soc., 1964, 60, 817, https://doi.org/10.1039/tf9646000817
. [all data]
Dykyj, Svoboda, et al., 1999
Dykyj, J.; Svoboda, J.; Wilhoit, R.C.; Frenkel, M.L.; Hall, K.R.,
Vapor Pressure of Chemicals: Part A. Vapor Pressure and Antoine Constants for Hydrocarbons and Sulfur, Selenium, Tellurium and Hydrogen Containing Organic Compounds, Springer, Berlin, 1999, 373. [all data]
Stephenson and Malanowski, 1987
Stephenson, Richard M.; Malanowski, Stanislaw,
Handbook of the Thermodynamics of Organic Compounds, 1987, https://doi.org/10.1007/978-94-009-3173-2
. [all data]
White, Barnard--Smith, et al., 1952
White, P.T.; Barnard--Smith, D.G.; Fidler, F.A.,
Vapor Pressure--Temperature Relationships of Sulfur Compounds Related to Petroleum,
Ind. Eng. Chem., 1952, 44, 6, 1430-1438, https://doi.org/10.1021/ie50510a064
. [all data]
Mackle and Mayrick, 1962, 2
Mackle, H.; Mayrick, R.G.,
Studies in the thermochemistry of organic sulphides. Part 2.?The gas-phase heats of formation of ten aliphatic sulphides,
Trans. Faraday Soc., 1962, 58, 230, https://doi.org/10.1039/tf9625800230
. [all data]
Lange, 1985
Lange, N.A.,
Lange's Handbook of Chemistry, 13th Edition, J.A. Dean, ed(s)., McGraw-Hill, New York, NY, 1985, 1792. [all data]
Bol'shakov, et al., 1969
Bol'shakov, G.F., et al.,
Ultraviolet spectra of heteroorganic compounds, 1969, 101. [all data]