1-Chloro-3-isopropyl-4-methylbenzene
- Formula: C10H13Cl
- Molecular weight: 168.663
- IUPAC Standard InChIKey: ISPBEETWYSGCDQ-UHFFFAOYSA-N
- CAS Registry Number: 63831-93-6
- Chemical structure:
View 3d structure (requires JavaScript / HTML 5) - Permanent link for this species. Use this link for bookmarking this species for future reference.

Condensed phase thermochemistry data

Data compiled by: Hussein Y. Afeefy, Joel F. Liebman, and Stephen E. Stein
Quantity | Value | Units | Method | Reference | Comment |
---|---|---|---|---|---|
ΔfH°liquid | -108.0 ± 4.5 | kJ/mol | Eqk | Nesterova, Rozhnov, et al., 1985 |

Reaction thermochemistry data

Data compiled by: Hussein Y. Afeefy, Joel F. Liebman, and Stephen E. Stein
Individual Reactions
By formula: C7H7Cl + C13H19Cl = C10H13Cl + C10H13Cl
Quantity | Value | Units | Method | Reference | Comment |
---|---|---|---|---|---|
ΔrH° | -0.72 ± 0.50 | kJ/mol | Eqk | Nesterova, Rozhnov, et al., 1985 | liquid phase |
By formula: C10H13Cl = C10H13Cl
Quantity | Value | Units | Method | Reference | Comment |
---|---|---|---|---|---|
ΔrH° | -3.1 ± 1.1 | kJ/mol | Eqk | Nesterova, Rozhnov, et al., 1985 | liquid phase |

References

Nesterova, Rozhnov, et al., 1985
Nesterova, T.N.; Rozhnov, A.M.; Malova, T.N.; Kovzel, E.N.,
Molar enthalpies of formation of isopropylchlorobenzenes derived from equilibrium measurements,
J. Chem. Thermodyn., 1985, 17, 649-656. [all data]