Hexane, 2-chloro-
- Formula: C6H13Cl
- Molecular weight: 120.620
- IUPAC Standard InChIKey: GLCIPJOIEVLTPR-UHFFFAOYSA-N
- CAS Registry Number: 638-28-8
- Chemical structure:
- Other names: 2-Chlorohexane; 2-Hexyl chloride

Phase change data

Data compiled as indicated in comments:
TRC - Thermodynamics Research Center, NIST Boulder Laboratories, Chris Muzny director
ALS - Hussein Y. Afeefy, Joel F. Liebman, and Stephen E. Stein
AC - William E. Acree, Jr., James S. Chickos
Quantity | Value | Units | Method | Reference | Comment |
---|---|---|---|---|---|
Tboil | 396.65 | K | N/A | Galanina, 1953 | Uncertainty assigned by TRC = 4. K; TRC |
Tboil | 396.15 | K | N/A | Nekrasova, 1953 | Uncertainty assigned by TRC = 3. K; TRC |
Tboil | 399.15 | K | N/A | Underwood and Gale, 1934 | Uncertainty assigned by TRC = 3. K; TRC |
Tboil | 395. | K | N/A | Faragher and Garner, 1921 | Uncertainty assigned by TRC = 6. K; TRC |
Quantity | Value | Units | Method | Reference | Comment |
ΔvapH° | 43.82 ± 0.06 | kJ/mol | V | Wadso, 1968 | ALS |
Enthalpy of vaporization
ΔvapH (kJ/mol) | Temperature (K) | Method | Reference | Comment |
---|---|---|---|---|
40.9 | 315. | A | Stephenson and Malanowski, 1987 | Based on data from 300. to 399. K.; AC |

Reaction thermochemistry data

Data compiled by: Hussein Y. Afeefy, Joel F. Liebman, and Stephen E. Stein
Individual Reactions
By formula: C6H13Cl = C6H13Cl
Quantity | Value | Units | Method | Reference | Comment |
---|---|---|---|---|---|
ΔrH° | -0.607 | kJ/mol | Ciso | Roganov, Kabo, et al., 1969 | liquid phase |

References

Galanina, 1953
Galanina, R.S.,
Dokl. Akad. Nauk SSSR, 1953, 88, 983. [all data]
Nekrasova, 1953
Nekrasova, V.A.,
Dokl. Akad. Nauk SSSR, 1953, 88, 475. [all data]
Underwood and Gale, 1934
Underwood, H.W.; Gale, J.C.,
J. Am. Chem. Soc., 1934, 56, 2117. [all data]
Faragher and Garner, 1921
Faragher, W.F.; Garner, F.H.,
The Elimination of Hydrogen CHloride from Chlorohydrocarbons,
J. Am. Chem. Soc., 1921, 43, 1715-24. [all data]
Wadso, 1968
Wadso, I.,
Heats of vaporization of organic compounds II. Chlorides, bromides, and iodides,
Acta Chem. Scand., 1968, 22, 2438. [all data]
Stephenson and Malanowski, 1987
Stephenson, Richard M.; Malanowski, Stanislaw,
Handbook of the Thermodynamics of Organic Compounds, 1987, https://doi.org/10.1007/978-94-009-3173-2
. [all data]
Roganov, Kabo, et al., 1969
Roganov, G.N.; Kabo, G.Ya.; Adreevskii, D.N.,
Additivity of thermochemical properties for isomers of secondary n-alkane chlorides (C5-C10),
J. Org. Chem. USSR (Engl. Transl.), 1969, 5, 2037-2041. [all data]