Thiophene, 2,4-dimethyl-
- Formula: C6H8S
- Molecular weight: 112.193
- IUPAC Standard InChIKey: CPULIKNSOUFMPL-UHFFFAOYSA-N
- CAS Registry Number: 638-00-6
- Chemical structure:
View 3d structure (requires JavaScript / HTML 5) - Other names: 2,4-Dimethylthiophene

Phase change data

Data compiled by: William E. Acree, Jr., James S. Chickos
Enthalpy of vaporization
ΔvapH (kJ/mol) | Temperature (K) | Method | Reference | Comment |
---|---|---|---|---|
41.4 | 338. | A | Stephenson and Malanowski, 1987 | Based on data from 323. to 493. K. See also Dykyj, 1972 and Dykyj, Svoboda, et al., 1999. |

Normal alkane RI, polar column, custom temperature program

Data compiled by: NIST Mass Spectrometry Data Center, William E. Wallace, director

Column type CapillaryCapillary
Active phase DB-WaxSupelcowax-10
Column length (m) 60.
Carrier gas He
Substrate
Column diameter (mm) 0.2
Phase thickness (μm) 0.25
Program 40C(3min) => 2C/min => 150C => 4C/min => 220C(20min) => 5C/min => 230Cnot specified
I 1250.1230.
ReferenceGyawalia, Seo, et al., 2006Jung, Kim, et al., 2001
Comment MSDC-RI MSDC-RI

References

Stephenson and Malanowski, 1987
Stephenson, Richard M.; Malanowski, Stanislaw,
Handbook of the Thermodynamics of Organic Compounds, 1987, https://doi.org/10.1007/978-94-009-3173-2
. [all data]
Dykyj, 1972
Dykyj, J.,
Petrochemia, 1972, 12, 1, 13. [all data]
Dykyj, Svoboda, et al., 1999
Dykyj, J.; Svoboda, J.; Wilhoit, R.C.; Frenkel, M.L.; Hall, K.R.,
Vapor Pressure of Chemicals: Part A. Vapor Pressure and Antoine Constants for Hydrocarbons and Sulfur, Selenium, Tellurium and Hydrogen Containing Organic Compounds, Springer, Berlin, 1999, 373. [all data]