Propanal, 2,2-dimethyl-, oxime
- Formula: C5H11NO
- Molecular weight: 101.1469
- IUPAC Standard InChIKey: OEFVJAZWSLPDEP-UHFFFAOYSA-N
- CAS Registry Number: 637-91-2
- Chemical structure:
View 3d structure (requires JavaScript / HTML 5) - Other names: Pivalaldehyde, oxime; 2,2-Dimethylpropanal oxime

Reaction thermochemistry data

Data compiled by: John E. Bartmess
Individual Reactions
C5H10NO- + =
By formula: C5H10NO- + H+ = C5H11NO
Quantity | Value | Units | Method | Reference | Comment |
---|---|---|---|---|---|
ΔrH° | 1518. ± 11. | kJ/mol | G+TS | Bartmess, Scott, et al., 1979 | gas phase; value altered from reference due to change in acidity scale |
Quantity | Value | Units | Method | Reference | Comment |
ΔrG° | 1489. ± 10. | kJ/mol | IMRE | Bartmess, Scott, et al., 1979 | gas phase; value altered from reference due to change in acidity scale |

References

Bartmess, Scott, et al., 1979
Bartmess, J.E.; Scott, J.A.; McIver, R.T., Jr.,
The gas phase acidity scale from methanol to phenol,
J. Am. Chem. Soc., 1979, 101, 6047. [all data]