4-Mercaptophenol
- Formula: C6H6OS
- Molecular weight: 126.176
- IUPAC Standard InChIKey: BXAVKNRWVKUTLY-UHFFFAOYSA-N
- CAS Registry Number: 637-89-8
- Chemical structure:
View 3d structure (requires JavaScript / HTML 5) - Other names: p-Hydroxythiophenol; 4-Hydroxythiophenol; Phenol, 4-mercapto-; p-Mercaptophenol; Hydroquinone, monothio-; Monothiohydroquinone; Phenol, p-mercapto-; Thiohydroquinone; USAF B-57; 4-Hydroxybenzenethiol; NSC 46192; p-Hydroxybenzenethiol; 4-Sulfanylphenol

Phase change data

Data compiled by: Robert L. Brown and Stephen E. Stein
Reduced pressure boiling point
Tboil (K) | Pressure (bar) | Reference |
---|---|---|
422.7 | 0.033 | Aldrich Chemical Company Inc., 1990 |
440.2 | 0.060 | Weast and Grasselli, 1989 |
408.2 | 0.015 | Weast and Grasselli, 1989 |

Van Den Dool and Kratz RI, non-polar column, custom temperature program

Column type | Active phase | I | Reference | Comment |
---|---|---|---|---|
Capillary | VF-5MS | 1319.4 | Tret'yakov, 2008 | 30. m/0.25 mm/0.25 μm, He; Program: Multi-step temperature program; T(initial)=60C; T(final)=270C |

References

Aldrich Chemical Company Inc., 1990
Aldrich Chemical Company Inc.,
Catalog Handbook of Fine Chemicals, Aldrich Chemical Company, Inc., Milwaukee WI, 1990, 1. [all data]
Weast and Grasselli, 1989
CRC Handbook of Data on Organic Compounds, 2nd Editon, Weast,R.C and Grasselli, J.G., ed(s)., CRC Press, Inc., Boca Raton, FL, 1989, 1. [all data]
Tret'yakov, 2008
Tret'yakov, K.V.,
Retention Data. NIST Mass Spectrometry Data Center., NIST Mass Spectrometry Data Center, 2008. [all data]