Benzene, 1-chloro-4-iodo-
- Formula: C6H4ClI
- Molecular weight: 238.453
- IUPAC Standard InChIKey: GWQSENYKCGJTRI-UHFFFAOYSA-N
- CAS Registry Number: 637-87-6
- Chemical structure:
View 3d structure (requires JavaScript / HTML 5) - Other names: p-Chloroiodobenzene; p-Iodochlorobenzene; 1-Chloro-4-iodobenzene; 4-Chloroiodobenzene; 4-Iodochlorobenzene; 4-Chloro-1-iodo-benzene

Phase change data

Data compiled as indicated in comments:
BS - Robert L. Brown and Stephen E. Stein
TRC - Thermodynamics Research Center, NIST Boulder Laboratories, Chris Muzny director
Quantity | Value | Units | Method | Reference | Comment |
---|---|---|---|---|---|
Tboil | 500.2 | K | N/A | Weast and Grasselli, 1989 | BS |
Quantity | Value | Units | Method | Reference | Comment |
Tfus | 326.5 | K | N/A | Diepen and Scheffer, 1948 | Uncertainty assigned by TRC = 0.5 K; TRC |
Tfus | 327.15 | K | N/A | Sugden, 1924 | Uncertainty assigned by TRC = 1.5 K; TRC |

References

Weast and Grasselli, 1989
CRC Handbook of Data on Organic Compounds, 2nd Editon, Weast,R.C and Grasselli, J.G., ed(s)., CRC Press, Inc., Boca Raton, FL, 1989, 1. [all data]
Diepen and Scheffer, 1948
Diepen, G.A.M.; Scheffer, F.E.C.,
On Critical Phenomena of Saturated Solutions in Binary Systems,
J. Am. Chem. Soc., 1948, 70, 4081. [all data]
Sugden, 1924
Sugden, S.,
CXLI. The Influence of the Orientation of Surface Molecules on the Surface Tension of Pure Liquids.,
J. Chem. Soc., 1924, 125, 1167. [all data]