Glycylglycylglycylglycine
- Formula: C8H14N4O5
- Molecular weight: 246.2206
- IUPAC Standard InChIKey: QMOQBVOBWVNSNO-UHFFFAOYSA-N
- CAS Registry Number: 637-84-3
- Chemical structure:
View 3d structure (requires JavaScript / HTML 5) - Other names: Glycine, N-[N-(N-glycylglycyl)glycyl]-; N-[N-(N-glycylglycyl)glycyl]glycine

Condensed phase thermochemistry data

Data compiled by: Hussein Y. Afeefy, Joel F. Liebman, and Stephen E. Stein
Quantity | Value | Units | Method | Reference | Comment |
---|---|---|---|---|---|
ΔcH°solid | -3965.0 ± 3.2 | kJ/mol | Ccb | Wrede, 1911 |

Gas phase ion energetics data

Data evaluated by: Edward P. Hunter and Sharon G. Lias
Quantity | Value | Units | Method | Reference | Comment |
---|---|---|---|---|---|
Proton affinity (review) | 973.8 | kJ/mol | N/A | Hunter and Lias, 1998 | |
Quantity | Value | Units | Method | Reference | Comment |
Gas basicity | 928.2 | kJ/mol | N/A | Hunter and Lias, 1998 |

References

Wrede, 1911
Wrede, F.,
Uber die Bestimmung von Berbrennungswarmen mittels der kalorimetrischen Bombe unter Benutzung des Platinwiderstandsthermometers,
Z. Phys. Chem. (Leipzig), 1911, 81-94. [all data]
Hunter and Lias, 1998
Hunter, E.P.; Lias, S.G.,
Evaluated Gas Phase Basicities and Proton Affinities of Molecules: An Update,
J. Phys. Chem. Ref. Data, 1998, 27, 3, 413-656, https://doi.org/10.1063/1.556018
. [all data]