2-Furanmethanol, tetrahydro-, acetate
- Formula: C7H12O3
- Molecular weight: 144.1684
- IUPAC Standard InChIKey: AAQDYYFAFXGBFZ-UHFFFAOYSA-N
- CAS Registry Number: 637-64-9
- Chemical structure:
View 3d structure (requires JavaScript / HTML 5) - Other names: Furfuryl alcohol, tetrahydro-, acetate; Tetrahydrofurfuryl acetate; 2-Acetoxymethyloxolane; Tetrahydro-2-furanmethanol acetate; Tetrahydro-2-furanmethyl acetate; Acetic acid, tetrahydrofurfuryl ester

Van Den Dool and Kratz RI, non-polar column, temperature ramp

Column type | Active phase | I | Reference | Comment |
---|---|---|---|---|
Capillary | 5 % Phenyl methyl siloxane | 1098. | Zaikin, 2010 | 30. m/0.25 mm/0.25 μm, 15. K/min, 270. C @ 15. min; Tstart: 60. C |

Normal alkane RI, non-polar column, custom temperature program

Column type | Active phase | I | Reference | Comment |
---|---|---|---|---|
Capillary | SE-30 | 1055. | Vinogradov, 2004 | Program: not specified |

References

Zaikin, 2010
Zaikin, V.G.,
Personal communication: Retention indices measured during 2010, 2010. [all data]
Vinogradov, 2004
Vinogradov, B.A.,
Production, composition, properties and application of essential oils, 2004, retrieved from http://viness.narod.ru. [all data]