Phenylpropiolic acid
- Formula: C9H6O2
- Molecular weight: 146.1427
- IUPAC Standard InChIKey: XNERWVPQCYSMLC-UHFFFAOYSA-N
- CAS Registry Number: 637-44-5
- Chemical structure:
View 3d structure (requires JavaScript / HTML 5) - Other names: Phenylacetylenecarboxylic acid; 3-Phenylpropynoic acid; 2-Propynoic acid, 3-phenyl-; Phenylacetylene monocarboxylic acid; Phenylpropynoic acid; Propiolic acid, phenyl-; Propiolic acid, 3-phenyl-; 3-Phenylpropiolic acid; β-Phenylpropargylic acid; 3-Phenylpropargylic acid; NSC 13669

Condensed phase thermochemistry data

Data compiled as indicated in comments:
DRB - Donald R. Burgess, Jr.
ALS - Hussein Y. Afeefy, Joel F. Liebman, and Stephen E. Stein
Quantity | Value | Units | Method | Reference | Comment |
---|---|---|---|---|---|
ΔfH°liquid | -121.8 ± 4.0 | kJ/mol | Ccb | N/A | recalculated with modern CO2,H2O thermo; estimated uncertainty (NOTE all values in source also have wrong sign); DRB |
Quantity | Value | Units | Method | Reference | Comment |
ΔfH°solid | 146. | kJ/mol | Ccb | Moureu and Andre, 1914 | ALS |
Quantity | Value | Units | Method | Reference | Comment |
ΔcH°solid | -4277.3 | kJ/mol | Ccb | Moureu and Andre, 1914 | Corresponding ΔfHºsolid = -122. kJ/mol (simple calculation by NIST; no Washburn corrections); ALS |

Phase change data

Data compiled by: Thermodynamics Research Center, NIST Boulder Laboratories, Chris Muzny director
Quantity | Value | Units | Method | Reference | Comment |
---|---|---|---|---|---|
Tfus | 410. | K | N/A | Reimer, 1942 | Uncertainty assigned by TRC = 2. K |

Reaction thermochemistry data

Data compiled by: Hussein Y. Afeefy, Joel F. Liebman, and Stephen E. Stein
Individual Reactions
By formula: 2H2 + C9H6O2 = C9H10O2
Quantity | Value | Units | Method | Reference | Comment |
---|---|---|---|---|---|
ΔrH° | -304. ± 4.6 | kJ/mol | Chyd | Flitcroft and Skinner, 1958 | liquid phase |

References

Moureu and Andre, 1914
Moureu, C.; Andre, E.,
Thermochimie des composes acetyleniques,
Ann. Chim. Phys., 1914, 1, 113-145. [all data]
Reimer, 1942
Reimer, M.,
Preparation of Phenylpropiolic Acid,
J. Am. Chem. Soc., 1942, 64, 2510. [all data]
Flitcroft and Skinner, 1958
Flitcroft, T.L.; Skinner, H.A.,
Heats of hydrogenation Part 2.-Acetylene derivatives,
Trans. Faraday Soc., 1958, 54, 47-53. [all data]