Sulfanilamide

Condensed phase thermochemistry data

Data compiled as indicated in comments:
ALS - Hussein Y. Afeefy, Joel F. Liebman, and Stephen E. Stein
DH - Eugene S. Domalski and Elizabeth D. Hearing

Quantity Value Units Method Reference Comment
Δfsolid-458.3 ± 1.6kJ/molCcbCiocazanu and Meltzer, 1996Hfusion=24.0 kJ/mol; ALS
Δfsolid-592.0kJ/molCcbPushkareva and Kokoshko, 1946Author's hf298_condensed=-92.2 kcal/mol; ALS
Quantity Value Units Method Reference Comment
Δcsolid-2788.5 ± 1.6kJ/molCcbCiocazanu and Meltzer, 1996Hfusion=24.0 kJ/mol; ALS
Δcsolid-3510.kJ/molCcbPushkareva and Kokoshko, 1946Author's hf298_condensed=-92.2 kcal/mol; ALS

Constant pressure heat capacity of solid

Cp,solid (J/mol*K) Temperature (K) Reference Comment
220.9323.Satoh and Sogabe, 1941T = 0 to 100°C. Mean value.; DH

References

Ciocazanu and Meltzer, 1996
Ciocazanu, I.; Meltzer, V., Etude thermodynamique de certains medicaments, J. Therm. Anal., 1996, 47, 1755-1758. [all data]

Pushkareva and Kokoshko, 1946
Pushkareva, Z.V.; Kokoshko, Z.U., On the question of the relation between the structure and bacteriostatic activity of sulphanilamide compounds. I. The resonance energy of some sulphanilamide compounds, Zh. Obshch. Kim., 1946, 16, 1269-1278. [all data]

Satoh and Sogabe, 1941
Satoh, S.; Sogabe, T., The heat capacities of some organic compounds containing nitrogen and the atomic heat of nitrogen. (2), Sci., Pap. Inst. Phys. Chem. Res. (Tokyo), 1941, 38, 231-237. [all data]