Clofibrate
- Formula: C12H15ClO3
- Molecular weight: 242.699
- IUPAC Standard InChIKey: KNHUKKLJHYUCFP-UHFFFAOYSA-N
- CAS Registry Number: 637-07-0
- Chemical structure:
View 3d structure (requires JavaScript / HTML 5) - Other names: Propanoic acid, 2-(4-chlorophenoxy)-2-methyl-, ethyl ester; Propionic acid, 2-(p-chlorophenoxy)-2-methyl-, ethyl ester; Amotril; Anparton; Ateculon; Ateriosan; Atheropront; Atromid S; Atromidin; Azionyl; AY 61123; Cartagyl; Claripex; Claripex CPIB; Clobren SF; Clofibrat; CPIB; Ethyl α-(p-Chlorophenoxy)-α-methylpropionate; Ethyl α-(p-chlorophenoxy)isobutyrate; Ethyl α-(4-chlorophenoxy)-α-methylpropionate; Ethyl α-(4-chlorophenoxy)isobutyrate; Ethyl clofibrate; Ethyl 2-(p-chlorophenoxy)-2-methylpropionate; Ethyl 2-(p-chlorophenoxy)isobutyrate; Ethyl 2-(4-chlorophenoxy)-2-methylpropionate; EPIB; Hyclorate; ICI 28257; Klofibrat; Lipavil; Lipavlon; Lipomid; Miscleron; Neo-Atromid; Normet; Recolip; Regelan; Serotinex; Skleromexe; 2-(p-Chlorophenoxy)-2-methylpropionic acid ethyl ester; 2-(4-Chlorophenoxy)-2-methylpropanoic acid ethyl ester; 2-(p-Chlorophenoxy)isobutyric acid ethyl ester; α-p-Chlorophenoxyisobutyryl ethyl ester; neo-Atomid; Acetic acid, (p-chlorophenoxy)dimethyl-, ethyl ester; Amotril S; Angiokapsul; Antilipid; Antilipide; Apolan; Arterioflexin; Arterosol; Artes; Athebrate; Atheromide; Athranid-Wirkstoff; Atrolen; Atromid; Atromida; Atrovis; Bioscleran; Bresit; Chlorphenisate; Cinnarizin; Citiflus; Clobrat; Clofar; Clofibate; Clofibram; Clofibrato; Clofibratum; Clofinit; Clofipront; Delipid; Deliva; Dura clofibrat; Ethyl chlorophenoxyisobutyrate; Ethyl p-chlorophenoxyisobutyrate; ELPI; Fibralem; Gerastop; Isobutyric acid, α-(p-chlorophenoxy)-, ethyl ester; Klofiran; Levatrom; Lipamid; Lipide 500; Lipidsenker; Lipofacton; Liponorm; Liporeduct; Liporil; Liposid; Liprin; Liprinal; Lobetrin; Normalip; Normat; Oxan 600; Persantinat; Propanoic acid, 2-(p-chlorophenoxy)-2-methyl-, ethyl ester; Propionic acid, 2-(4-chlorophenoxy)-2-methyl-, ethyl ester; Regardin; Sklero; Sklero-Tablinen; Ticlobran; Xyduril; Artevil; α-(p-Chlorophenoxy)isobutyric acid, ethyl ester; Cloberat; Ethyl para-chlorophenoxyisobutyrate; Negalip; Normolipol; NSC-79389; Regelan N; Robigram; Scrobin; Serofinex; Skerolip; Skleromex; Sklero-tabuls; Vincamin compositum; Yoclo; Chlorfenisate; Sklerepmexe; Sklero-Tablinene; Sklerolip; Abitrate; p-Chlorophenoxyisobutyric acid ethyl ester; Ethyl 2-(4-chlorophenoxy)isobutyrate; Misclerone

Phase change data

Data compiled by: Robert L. Brown and Stephen E. Stein
Reduced pressure boiling point
Tboil (K) | Pressure (atm) | Reference |
---|---|---|
428.2 | 0.026 | Aldrich Chemical Company Inc., 1990 |

Normal alkane RI, non-polar column, temperature ramp

View large format table.

Column type Active phase I Reference Comment
CapillaryDB-11524.Sharp, 198715. m/0.25 mm/0.25 μm, He, 130. C @ 1. min, 10. K/min, 290. C @ 10. min
PackedSE-301515.Marozzi, Gambaro, et al., 1982Gas Chrom P, 2.5 K/min; Column length: 2. m; Tstart: 120. C; Tend: 200. C

Normal alkane RI, non-polar column, custom temperature program

View large format table.

Column type Active phase I Reference Comment
CapillaryOV-1, SE-30, Methyl silicone, SP-2100, OV-101, DB-1, etc.1549.Waggott and Davies, 1984Hydrogen; Column length: 50. m; Column diameter: 0.32 mm; Program: not specified
OtherMethyl Silicone1549.Ardrey and Moffat, 1981Program: not specified

References

Aldrich Chemical Company Inc., 1990
Aldrich Chemical Company Inc.,
Catalog Handbook of Fine Chemicals, Aldrich Chemical Company, Inc., Milwaukee WI, 1990, 1. [all data]