1-Cyclohexene-1-carboxylic acid
- Formula: C7H10O2
- Molecular weight: 126.1531
- IUPAC Standard InChIKey: NMEZJSDUZQOPFE-UHFFFAOYSA-N
- CAS Registry Number: 636-82-8
- Chemical structure:

Phase change data

Data compiled by: Robert L. Brown and Stephen E. Stein
Reduced pressure boiling point
Tboil (K) | Pressure (bar) | Reference |
---|---|---|
411. to 413. | 0.019 | Frinton Laboratories Inc., 1986 |

References

Frinton Laboratories Inc., 1986
Frinton Laboratories Inc.,
Catalog Number 11, Frinton Laboratories Inc., Vineland, NJ, 1986, 99. [all data]
Jones and Whiting, 1956
Jones, E.R.H.; Whiting, M.C.,
J. Chem. Soc., 1956, 4073. [all data]