1-Phenyl-2-hydroxy-1-buten-3-one
- Formula: C10H10O2
- Molecular weight: 162.1852
- IUPAC Standard InChIKey: FXMXAFDOFYLVFW-YFHOEESVSA-N
- CAS Registry Number: 6362-60-3
- Chemical structure:
View 3d structure (requires JavaScript / HTML 5) - Species with the same structure:

Condensed phase thermochemistry data

Data compiled by: Hussein Y. Afeefy, Joel F. Liebman, and Stephen E. Stein
Quantity | Value | Units | Method | Reference | Comment |
---|---|---|---|---|---|
ΔfH°liquid | 330. | kJ/mol | Ccb | Moureu, 1930 | |
Quantity | Value | Units | Method | Reference | Comment |
ΔcH°liquid | 5055.1 | kJ/mol | Ccb | Moureu, 1930 | Corresponding ΔfHºliquid = -10419. kJ/mol (simple calculation by NIST; no Washburn corrections) |

References

Moureu, 1930
Moureu, M.H.,
Des sur la tautomerie des dicetones α,
Ann. Chem., 1930, 14, 283-405. [all data]