4H-1,2,4-triazole
- Formula: C2H3N3
- Molecular weight: 69.0653
- IUPAC Standard InChIKey: NSPMIYGKQJPBQR-UHFFFAOYSA-N
- CAS Registry Number: 63598-71-0
- Chemical structure:
View 3d structure (requires JavaScript / HTML 5) - Species with the same structure:

Reaction thermochemistry data

Data compiled by: Robert C. Dunbar
Individual Reactions
By formula: Na+ + C2H3N3 = (Na+ • C2H3N3)
Quantity | Value | Units | Method | Reference | Comment |
---|---|---|---|---|---|
ΔrH° | 124. ± 5.0 | kJ/mol | CIDT | Rodgers and Armentrout, 1999 |
Free energy of reaction
ΔrG° (kJ/mol) | T (K) | Method | Reference |
---|---|---|---|
0.0 | 0. | CIDT | Rodgers and Armentrout, 1999 |

Ion clustering data

Data compiled by: Robert C. Dunbar
Clustering reactions
By formula: Na+ + C2H3N3 = (Na+ • C2H3N3)
Quantity | Value | Units | Method | Reference | Comment |
---|---|---|---|---|---|
ΔrH° | 124. ± 5.0 | kJ/mol | CIDT | Rodgers and Armentrout, 1999 |
Free energy of reaction
ΔrG° (kJ/mol) | T (K) | Method | Reference |
---|---|---|---|
0.0 | 0. | CIDT | Rodgers and Armentrout, 1999 |

References

Rodgers and Armentrout, 1999
Rodgers, M.T.; Armentrout, P.B.,
Absolute Alkali Metal Ion Binding Affinities of Several Azoles Determined by Threshold Collision-Induced Dissociation,
Int. J. Mass Spectrom. Ion Proc., 1999, 185/186/187, 359. [all data]