1,2,4,5-Benzenetetracarboxylic acid, tetramethyl ester
- Formula: C14H14O8
- Molecular weight: 310.2562
- IUPAC Standard InChIKey: QVEIFJBUBJUUMB-UHFFFAOYSA-N
- CAS Registry Number: 635-10-9
- Chemical structure:
View 3d structure (requires JavaScript / HTML 5) - Other names: Pyromellitic acid tetramethyl ester; Tetramethyl pyromellitate; Tetramethyl 1,2,4,5-benzenetetracarboxylate; Tetramethyl benzene-1,2,4,5-tetracarboxylate

Gas phase thermochemistry data

Data compiled as indicated in comments:
DRB - Donald R. Burgess, Jr.
ALS - Hussein Y. Afeefy, Joel F. Liebman, and Stephen E. Stein
Quantity | Value | Units | Method | Reference | Comment |
---|---|---|---|---|---|
ΔfH°gas | -1361.3 | kJ/mol | N/A | Dibrivnyi and Donchak, 1982 | Value computed using ΔfHsolid° value of -1440.3±2.4 kj/mol from Dibrivnyi and Donchak, 1982 and ΔsubH° value of 79.0 kj/mol from Van Chin, Dibrivnyi, et al., 1980.; DRB |
ΔfH°gas | -1352. ± 16. | kJ/mol | Ccb | Van Chin, Dibrivnyi, et al., 1980 | Heat of combustion is not reported; ALS |
ΔfH°gas | -1353.2 | kJ/mol | N/A | Colomina, Laynez, et al., 1972 | Value computed using ΔfHsolid° value of -1432.2±1.2 kj/mol from Colomina, Laynez, et al., 1972 and ΔsubH° value of 79.0 kj/mol from Van Chin, Dibrivnyi, et al., 1980.; DRB |

Condensed phase thermochemistry data

Data compiled by: Hussein Y. Afeefy, Joel F. Liebman, and Stephen E. Stein
Quantity | Value | Units | Method | Reference | Comment |
---|---|---|---|---|---|
ΔfH°solid | -1440.3 ± 2.4 | kJ/mol | Ccb | Dibrivnyi and Donchak, 1982 | see Van-Chin-Syan, Dibrivnyi, et al., 1981 |
ΔfH°solid | -1431.0 ± 2.4 | kJ/mol | Ccb | Van Chin, Dibrivnyi, et al., 1980 | Heat of combustion is not reported |
ΔfH°solid | -1432.2 ± 1.2 | kJ/mol | Ccb | Colomina, Laynez, et al., 1972 | |
Quantity | Value | Units | Method | Reference | Comment |
ΔcH°solid | -6069.1 ± 2.4 | kJ/mol | Ccb | Dibrivnyi and Donchak, 1982 | see Van-Chin-Syan, Dibrivnyi, et al., 1981; Corresponding ΔfHºsolid = -1440.9 kJ/mol (simple calculation by NIST; no Washburn corrections) |
ΔcH°solid | -6077.60 ± 0.91 | kJ/mol | Ccb | Colomina, Laynez, et al., 1972 | Corresponding ΔfHºsolid = -1432.35 kJ/mol (simple calculation by NIST; no Washburn corrections) |

Phase change data

Data compiled as indicated in comments:
TRC - Thermodynamics Research Center, NIST Boulder Laboratories, Chris Muzny director
AC - William E. Acree, Jr., James S. Chickos
DRB - Donald R. Burgess, Jr.
Quantity | Value | Units | Method | Reference | Comment |
---|---|---|---|---|---|
Tfus | 418.0 | K | N/A | Dozen, Fujishima, et al., 1978 | Uncertainty assigned by TRC = 0.1 K; TRC |
Quantity | Value | Units | Method | Reference | Comment |
ΔsubH° | 143.3 ± 0.8 | kJ/mol | N/A | Jimenez, Menendez, et al., 1995 | AC |
ΔsubH° | 79.0 | kJ/mol | N/A | Van Chin, Dibrivnyi, et al., 1980 | DRB |
ΔsubH° | 135.9 ± 1.3 | kJ/mol | N/A | Turrión, 1967 | See also Jimenez, Menendez, et al., 1995.; AC |
Enthalpy of sublimation
ΔsubH (kJ/mol) | Temperature (K) | Method | Reference | Comment |
---|---|---|---|---|
140.4 ± 0.8 | 381. | ME | Jimenez, Menendez, et al., 1995 | Based on data from 371. to 391. K.; AC |
Enthalpy of fusion
ΔfusH (kJ/mol) | Temperature (K) | Method | Reference | Comment |
---|---|---|---|---|
35.7 | 416.7 | DSC | Acree, 1993 | AC |

Kovats' RI, non-polar column, isothermal

Column type | Active phase | Temperature (C) | I | Reference | Comment |
---|---|---|---|---|---|
Packed | OV-1 | 200. | 2095. | Fedoreev and Maksimov, 1977 | Gaschrom; Column length: 1.5 m |

References

Dibrivnyi and Donchak, 1982
Dibrivnyi, V.N.; Donchak, V.A.,
Standard enthalpies of formation of some pyromellitic acid esters, Deposited Document, SPSTL 1014 Khp-D80. Chem. Abst. 97:134437j, 1982, 19-23. [all data]
Van Chin, Dibrivnyi, et al., 1980
Van Chin, S.; Dibrivnyi, N.V.; Donchak, V.A.,
Peroxide bond energy in tetra-tert-butyl peroxypyromellitate,
Vestn. L'vov. Politekhn. In-ta, 1980, 18-21. [all data]
Colomina, Laynez, et al., 1972
Colomina, M.; Laynez, J.L.; Perez-Ossorio, R.; Turrion, C.,
Enthalpies of combustion and formation of six methyl esters of benzene carboxylic acids,
J. Chem. Thermodyn., 1972, 4, 499-506. [all data]
Van-Chin-Syan, Dibrivnyi, et al., 1981
Van-Chin-Syan, Y.; Dibrivnyi, V.N.; Donchak, V.A.; Chuchmarev, S.K.,
Standard enthalpies of combustion and formation of pyromellitic esters,
Russ. J. Phys. Chem. (Engl. Transl.), 1981, 55, 747. [all data]
Dozen, Fujishima, et al., 1978
Dozen, Y.; Fujishima, S.; Shingu, H.,
Structures and fusion parameters of methoxycarbonyl-benzenes and -naphthalenes,
Thermochim. Acta, 1978, 25, 2, 209, https://doi.org/10.1016/0040-6031(78)85008-4
. [all data]
Jimenez, Menendez, et al., 1995
Jimenez, P.; Menendez, V.; Roux, M.V.; Turrion, C.,
Vapour pressures and enthalpies of sublimation of four polymethoxycarbonylbenzenes,
J. Chem. Thermodyn., 1995, 27, 679-683. [all data]
Turrión, 1967
Turrión, C.,
, Presiones de vapor y calores de sublimación de los ácidos bencenecarboxilicos y sus ésteres metilicos. Beca "Juan March" de estudios en España, grupo B, Madrid, 1967. [all data]
Acree, 1993
Acree, William E.,
Thermodynamic properties of organic compounds,
Thermochimica Acta, 1993, 219, 97-104, https://doi.org/10.1016/0040-6031(93)80486-T
. [all data]
Fedoreev and Maksimov, 1977
Fedoreev, S.A.; Maksimov, O.B.,
The study of the composition of aromatic esters by gas-liquid chromatography,
Solid Fuel Chem. (Engl. Transl.), 1977, 17-22. [all data]