1H-Pyrrole-2-carboxylic acid
- Formula: C5H5NO2
- Molecular weight: 111.0987
- IUPAC Standard InChIKey: WRHZVMBBRYBTKZ-UHFFFAOYSA-N
- CAS Registry Number: 634-97-9
- Chemical structure:
View 3d structure (requires JavaScript / HTML 5) - Other names: Pyrrole-2-carboxylic acid; Minalin; Minaline; PCA

Phase change data

Data compiled by: William E. Acree, Jr., James S. Chickos
Quantity | Value | Units | Method | Reference | Comment |
---|---|---|---|---|---|
ΔsubH° | 100.8 ± 0.9 | kJ/mol | ME | Santos and Silva, 2009 | Based on data from 331. to 353. K. |
Enthalpy of sublimation
ΔsubH (kJ/mol) | Temperature (K) | Method | Reference | Comment |
---|---|---|---|---|
98.6 ± 0.9 | 342. | ME | Santos and Silva, 2009 | Based on data from 331. to 353. K. |
126.8 | 352. | ME | Bradley and Care, 1953 | Based on data from 350. to 354. K. See also Jones, 1960. |

References

Santos and Silva, 2009
Santos, Ana Filipa L.O.M.; Silva, Manuel A.V. Ribeiro da,
Experimental and Computational Study on the Molecular Energetics of 2-Pyrrolecarboxylic Acid and 1-Methyl-2-pyrrolecarboxylic Acid,
J. Phys. Chem. A, 2009, 113, 35, 9741-9750, https://doi.org/10.1021/jp905375h
. [all data]
Bradley and Care, 1953
Bradley, R.S.; Care, A.D.,
348. The vapour pressure and lattice energy of hydrogen-bonded crystals. Part III. 2-Thenoic, 2-furoic, and pyrrole-2-carboxylic acids,
J. Chem. Soc., 1953, 1688, https://doi.org/10.1039/jr9530001688
. [all data]
Jones, 1960
Jones, A.H.,
Sublimation Pressure Data for Organic Compounds.,
J. Chem. Eng. Data, 1960, 5, 2, 196-200, https://doi.org/10.1021/je60006a019
. [all data]
Huhn and Brossmer, 1956
Huhn, R.; Brossmer, R.,
Chem. Ber., 1956, 89, 2013. [all data]