Trichlorobenzoquinone
- Formula: C6HCl3O2
- Molecular weight: 211.430
- IUPAC Standard InChIKey: KSFNQTZBTVALRV-UHFFFAOYSA-N
- CAS Registry Number: 634-85-5
- Chemical structure:
View 3d structure (requires JavaScript / HTML 5) - Permanent link for this species. Use this link for bookmarking this species for future reference.

Condensed phase thermochemistry data

Data compiled by: Hussein Y. Afeefy, Joel F. Liebman, and Stephen E. Stein
Quantity | Value | Units | Method | Reference | Comment |
---|---|---|---|---|---|
ΔfH°solid | -280. | kJ/mol | Ccb | Sjostrom, 1936 | At 318 K |
Quantity | Value | Units | Method | Reference | Comment |
ΔcH°solid | -2305.4 ± 8.4 | kJ/mol | Ccb | Smith, Bjellerup, et al., 1953 | Reanalyzed by Cox and Pilcher, 1970, Original value = -2307.0 ± 6.3 kJ/mol |
ΔcH°solid | -2296. | kJ/mol | Ccb | Sjostrom, 1936 | At 318 K |
ΔcH°solid | -2286. | kJ/mol | Ccb | Swietoslawski and Starczedska, 1925 |

Phase change data

Data compiled as indicated in comments:
ALS - Hussein Y. Afeefy, Joel F. Liebman, and Stephen E. Stein
AC - William E. Acree, Jr., James S. Chickos
Quantity | Value | Units | Method | Reference | Comment |
---|---|---|---|---|---|
ΔsubH° | 88.701 | kJ/mol | V | Coolidge and Coolidge, 1927 | ALS |
Enthalpy of sublimation
ΔsubH (kJ/mol) | Temperature (K) | Method | Reference | Comment |
---|---|---|---|---|
88.7 ± 8.3 | 301. to 327. | QF | Coolidge and Coolidge, 1927 | See also Jones, 1960 and Cox and Pilcher, 1970, 2.; AC |

Gas phase ion energetics data

Data compiled by: John E. Bartmess
Electron affinity determinations
EA (eV) | Method | Reference | Comment |
---|---|---|---|
2.611 ± 0.048 | IMRE | Fukuda and McIver, 1985 | ΔGea(355 K) = -59.0 kcal/mol; ΔSea =-3.5, est. from data in Heinis, Chowdhury, et al., 1988 |

References

Sjostrom, 1936
Sjostrom, Av.G.,
De klorsubstituerade kinonernas och hydrokinonernas termokemi,
Svensk. Kim. Tidr., 1936, 48, 121-124. [all data]
Smith, Bjellerup, et al., 1953
Smith, L.; Bjellerup, L.; Krook, S.; Westermark, H.,
Heats of combustion of organic chloro compounds determined by the "quartz wool" method,
Acta Chem. Scand., 1953, 7, 65. [all data]
Cox and Pilcher, 1970
Cox, J.D.; Pilcher, G.,
Thermochemistry of Organic and Organometallic Compounds, Academic Press, New York, 1970, 1-636. [all data]
Swietoslawski and Starczedska, 1925
Swietoslawski, W.; Starczedska, H.,
Correction des donnees thermochimiques de M.A. Valeur,
J. Chem. Phys., 1925, 22, 399-401. [all data]
Coolidge and Coolidge, 1927
Coolidge, A.S.; Coolidge, M.S.,
The sublimation pressures of substituted quinones and hydroquinones,
J. Am. Chem. Soc., 1927, 49, 100-104. [all data]
Jones, 1960
Jones, A.H.,
Sublimation Pressure Data for Organic Compounds.,
J. Chem. Eng. Data, 1960, 5, 2, 196-200, https://doi.org/10.1021/je60006a019
. [all data]
Cox and Pilcher, 1970, 2
Cox, J.D.; Pilcher, G.,
Thermochemistry of Organic and Organometallic Compounds, Academic Press Inc., London, 1970, 643. [all data]
Fukuda and McIver, 1985
Fukuda, E.K.; McIver, R.T., Jr.,
Relative electron affinities of substituted benzophenones, nitrobenzenes, and quinones. [Anchored to EA(SO2) from 74CEL/BEN],
J. Am. Chem. Soc., 1985, 107, 2291. [all data]
Heinis, Chowdhury, et al., 1988
Heinis, T.; Chowdhury, S.; Scott, S.L.; Kebarle, P.,
Electron Affinities of Benzo-, Naphtho-, and Anthraquinones Determined from Gas-Phase Equilibria Measurements,
J. Am. Chem. Soc., 1988, 110, 2, 400, https://doi.org/10.1021/ja00210a015
. [all data]