p-Pentyloxynitrobenzene
- Formula: C11H15NO3
- Molecular weight: 209.2417
- IUPAC Standard InChIKey: ITRUYYFRYGZFBF-UHFFFAOYSA-N
- CAS Registry Number: 63469-11-4
- Chemical structure:
View 3d structure (requires JavaScript / HTML 5) - Other names: Benzene, 1-nitro-4-pentyloxy; p-Nitrophenyl pentyl ether

Phase change data

Data compiled by: Robert L. Brown and Stephen E. Stein
Reduced pressure boiling point
Tboil (K) | Pressure (bar) | Reference |
---|---|---|
465. to 468. | 0.021 | Frinton Laboratories Inc., 1986 |

References

Frinton Laboratories Inc., 1986
Frinton Laboratories Inc.,
Catalog Number 11, Frinton Laboratories Inc., Vineland, NJ, 1986, 99. [all data]