Ethyl 2-cyanoacetoacetate
- Formula: C7H9NO3
- Molecular weight: 155.1513
- IUPAC Standard InChIKey: NWOKVFOTWMZMHL-UHFFFAOYSA-N
- CAS Registry Number: 634-55-9
- Chemical structure:
View 3d structure (requires JavaScript / HTML 5) - Other names: Ethyl a-cyanoacetoacetate; Ethyl α-cyanoacetoacetate

Condensed phase thermochemistry data

Data compiled by: Hussein Y. Afeefy, Joel F. Liebman, and Stephen E. Stein
Quantity | Value | Units | Method | Reference | Comment |
---|---|---|---|---|---|
ΔfH°solid | -536.8 | kJ/mol | Ccb | Guinchant, 1918 | Author hf288_condensed[kcal/mol]=-133.6 kcal/mol |
Quantity | Value | Units | Method | Reference | Comment |
ΔcH°solid | -3504. | kJ/mol | Ccb | Guinchant, 1918 | Author hf288_condensed[kcal/mol]=-133.6 kcal/mol |

Phase change data

Data compiled by: Robert L. Brown and Stephen E. Stein
Reduced pressure boiling point
Tboil (K) | Pressure (bar) | Reference |
---|---|---|
378. to 380. | 0.020 | Frinton Laboratories Inc., 1986 |

References

Guinchant, 1918
Guinchant, M.J.,
Etude sur la fonction acide dans les derives metheniques et methiniques,
Ann. Chem., 1918, 10, 30-84. [all data]
Frinton Laboratories Inc., 1986
Frinton Laboratories Inc.,
Catalog Number 11, Frinton Laboratories Inc., Vineland, NJ, 1986, 99. [all data]