Quinoxaline, 6-methyl-
- Formula: C9H8N2
- Molecular weight: 144.1732
- IUPAC Standard InChIKey: OSRARURJYPOUOV-UHFFFAOYSA-N
- CAS Registry Number: 6344-72-5
- Chemical structure:
View 3d structure (requires JavaScript / HTML 5) - Other names: 6-Methylquinoxaline

Phase change data

Data compiled by: Thermodynamics Research Center, NIST Boulder Laboratories, Chris Muzny director
Quantity | Value | Units | Method | Reference | Comment |
---|---|---|---|---|---|
Tboil | 516.9 | K | N/A | Bruhl, 1897 | Uncertainty assigned by TRC = 2. K |

References

Bruhl, 1897
Bruhl, J.W.,
Spectrochemistry of nitrogen containing compounds V,
Z. Phys. Chem., Stoechiom. Verwandtschaftsl., 1897, 22, 373. [all data]