3-Diethylamino-2,2-dimethylpropionaldehyde
- Formula: C9H19NO
- Molecular weight: 157.2533
- IUPAC Standard InChIKey: AAHIYAKUVPMLMX-UHFFFAOYSA-N
- CAS Registry Number: 6343-47-1
- Chemical structure:
View 3d structure (requires JavaScript / HTML 5) - Other names: α,α-Dimethyl-β-diethylaminopropionaldehyde; Diethylaminopivalaldehyde; Propanal, 3-(diethylamino)-2,2-dimethyl-; Propionaldehyde, 3-(diethylamino)-2,2-dimethyl-

Phase change data

Data compiled by: Robert L. Brown and Stephen E. Stein
Reduced pressure boiling point
Tboil (K) | Pressure (bar) | Reference |
---|---|---|
378. to 379. | 0.053 | Frinton Laboratories Inc., 1986 |

References

Frinton Laboratories Inc., 1986
Frinton Laboratories Inc.,
Catalog Number 11, Frinton Laboratories Inc., Vineland, NJ, 1986, 99. [all data]