Bicyclo[2.2.1]hept-5-ene-2,2,3,3-tetracarbonitrile
- Formula: C11H6N4
- Molecular weight: 194.1921
- IUPAC Standard InChIKey: OTRJLHGHUSIRSP-UHFFFAOYSA-N
- CAS Registry Number: 6343-21-1
- Chemical structure:
View 3d structure (requires JavaScript / HTML 5) - Permanent link for this species. Use this link for bookmarking this species for future reference.

Gas phase thermochemistry data

Data compiled by: Hussein Y. Afeefy, Joel F. Liebman, and Stephen E. Stein
Quantity | Value | Units | Method | Reference | Comment |
---|---|---|---|---|---|
ΔfH°gas | 738.9 | kJ/mol | Cm | Rogers, 1972 |

Phase change data

Data compiled as indicated in comments:
ALS - Hussein Y. Afeefy, Joel F. Liebman, and Stephen E. Stein
AC - William E. Acree, Jr., James S. Chickos
Quantity | Value | Units | Method | Reference | Comment |
---|---|---|---|---|---|
ΔsubH° | 117.2 ± 5.4 | kJ/mol | V | Rogers, 1972 | ALS |
Enthalpy of sublimation
ΔsubH (kJ/mol) | Temperature (K) | Method | Reference | Comment |
---|---|---|---|---|
117.2 ± 5.4 | 408. | MG | Rogers, 1972 | See also Pedley and Rylance, 1977.; AC |

Reaction thermochemistry data

Data compiled by: Hussein Y. Afeefy, Joel F. Liebman, and Stephen E. Stein
Individual Reactions
By formula: C5H6 + C6N4 = C11H6N4
Quantity | Value | Units | Method | Reference | Comment |
---|---|---|---|---|---|
ΔrH° | -112. | kJ/mol | Kin | Samuilov, Bukharov, et al., 1981 | liquid phase; solvent: Chorobenzene |
ΔrH° | -106.9 ± 2.9 | kJ/mol | Cm | Rogers, 1972 | liquid phase |
By formula: C11H6N4 = C5H6 + C6N4
Quantity | Value | Units | Method | Reference | Comment |
---|---|---|---|---|---|
ΔrH° | 106.9 ± 2.9 | kJ/mol | Cm | Rogers, 1972 | solid phase |

References

Rogers, 1972
Rogers, F.E.,
Thermochemistry of the Diels-Alder reactions. II. Heat of addition of several dienes to tetracyanoethylene,
J. Phys. Chem., 1972, 76, 106-109. [all data]
Pedley and Rylance, 1977
Pedley, J.B.; Rylance, J.,
, Computer Analysed Thermochemical Data: Organic and Organometallic Compounds, University of Sussex, Brighton, 1977. [all data]
Samuilov, Bukharov, et al., 1981
Samuilov, Ya.D.; Bukharov, S.V.; Konovalov, A.I.,
Reactivity of tetraphenylcyclopentadiene and tetracyclone in the Diels-Alder reaction with cyanoethylenes,
Zh. Org. Khim., 1981, 17, 2389-2393. [all data]