(2-endo,3-exo)-bicyclo[2.2.1]hept-5-ene-2,3-dicarbonitrile
- Formula: C9H8N2
- Molecular weight: 144.1732
- IUPAC Standard InChIKey: DJNPQHBMESQZIP-UHFFFAOYSA-N
- CAS Registry Number: 6343-16-4
- Chemical structure:
View 3d structure (requires JavaScript / HTML 5) - Permanent link for this species. Use this link for bookmarking this species for future reference.

Phase change data

Data compiled by: Thermodynamics Research Center, NIST Boulder Laboratories, Chris Muzny director
Quantity | Value | Units | Method | Reference | Comment |
---|---|---|---|---|---|
Ttriple | 370.8 | K | N/A | Weinstein, Leffler, et al., 1984 | Crystal phase 1 phase; Uncertainty assigned by TRC = 1.5 K |

References

Weinstein, Leffler, et al., 1984
Weinstein, D.I.; Leffler, A.J.; Currie, J.A.,
Phase Transitions in Bicyclic Compounds,
Mol. Cryst. Liq. Cryst., 1984, 104, 95. [all data]