Lactose
- Formula: C12H22O11
- Molecular weight: 342.2965
- IUPAC Standard InChIKey: GUBGYTABKSRVRQ-SDWOOCBUSA-N
- CAS Registry Number: 63-42-3
- Chemical structure:
- Other names: D-Glucose, 4-O-β-D-galactopyranosyl-; (+)-Lactose; Aletobiose; Galactinum; Lactin; Lactobiose; Milk sugar; Osmolactan; Saccharum lactin; 4-(β-D-Galactosido)-D-glucose; D-Lactose; AHL; Fast-flo; Fast-Flo Lactose; Lactin (carbohydrate); Lactose Fast-flo; Pharmatose 21; Tablettose; Zeparox EP; D-glucose, 4-(beta-d-galactosido)-

Reaction thermochemistry data

Data compiled by: Robert C. Dunbar
Individual Reactions
By formula: Na+ + C12H22O11 = (Na+ • C12H22O11)
Quantity | Value | Units | Method | Reference | Comment |
---|---|---|---|---|---|
ΔrH° | 204. | kJ/mol | CIDC | Cerda and Wesdemiotis, 1999 |
Free energy of reaction
ΔrG° (kJ/mol) | T (K) | Method | Reference |
---|---|---|---|
0.0 | 298. | CIDC | Cerda and Wesdemiotis, 1999 |

Ion clustering data

Data compiled by: Robert C. Dunbar
Clustering reactions
By formula: Na+ + C12H22O11 = (Na+ • C12H22O11)
Quantity | Value | Units | Method | Reference | Comment |
---|---|---|---|---|---|
ΔrH° | 204. | kJ/mol | CIDC | Cerda and Wesdemiotis, 1999 |
Free energy of reaction
ΔrG° (kJ/mol) | T (K) | Method | Reference |
---|---|---|---|
0.0 | 298. | CIDC | Cerda and Wesdemiotis, 1999 |

Condensed phase thermochemistry data

Data compiled by: Eugene S. Domalski and Elizabeth D. Hearing
Constant pressure heat capacity of solid
Cp,solid (cal/mol*K) | Temperature (K) | Reference | Comment |
---|---|---|---|
99.81 | 300. | Kawaizumi, Nishio, et al., 1981 | T = 270 to 325 K. Cp given as 1.22 J/g*K. |

References

Cerda and Wesdemiotis, 1999
Cerda, B.A.; Wesdemiotis, C.,
Thermochemistry and Structures of Na+ Coordinated Mono- and Disaccharide Stereoisomers,
Int. J. Mass Spectrom., 1999, 189, 2-3, 189, https://doi.org/10.1016/S1387-3806(99)00085-8
. [all data]