N,N-Dimethylethanesulfonamide
- Formula: C4H11NO2S
- Molecular weight: 137.201
- IUPAC Standard InChIKey: MORLSCQKZAPYFM-UHFFFAOYSA-N
- CAS Registry Number: 6338-68-7
- Chemical structure:
View 3d structure (requires JavaScript / HTML 5) - Other names: Ethanesulfonamide, N,N-dimethyl-; N,N-dimethylethanesulphonamide

Phase change data

Data compiled as indicated in comments:
BS - Robert L. Brown and Stephen E. Stein
AC - William E. Acree, Jr., James S. Chickos
Quantity | Value | Units | Method | Reference | Comment |
---|---|---|---|---|---|
Tboil | 513. | K | N/A | Frinton Laboratories Inc., 1986 | BS |
Enthalpy of vaporization
ΔvapH (kJ/mol) | Temperature (K) | Method | Reference | Comment |
---|---|---|---|---|
54.3 | 399. | A | Stephenson and Malanowski, 1987 | Based on data from 384. to 517. K.; AC |

References

Frinton Laboratories Inc., 1986
Frinton Laboratories Inc.,
Catalog Number 11, Frinton Laboratories Inc., Vineland, NJ, 1986, 99. [all data]
Stephenson and Malanowski, 1987
Stephenson, Richard M.; Malanowski, Stanislaw,
Handbook of the Thermodynamics of Organic Compounds, 1987, https://doi.org/10.1007/978-94-009-3173-2
. [all data]