Benzene chromium dicarbonyl thiocarbonyl
- Formula: C9H6CrO2S
- Molecular weight: 230.204
- IUPAC Standard InChIKey: IFMRPMLHGYQETH-UHFFFAOYSA-N
- CAS Registry Number: 63356-86-5
- Chemical structure:
View 3d structure (requires JavaScript / HTML 5) - Permanent link for this species. Use this link for bookmarking this species for future reference.

Condensed phase thermochemistry data

Data compiled by: Eugene S. Domalski and Elizabeth D. Hearing
Quantity | Value | Units | Method | Reference | Comment |
---|---|---|---|---|---|
S°solid,1 bar | 292.8 | J/mol*K | N/A | Chhor, Pommier, et al., 1981 |
Constant pressure heat capacity of solid
Cp,solid (J/mol*K) | Temperature (K) | Reference | Comment |
---|---|---|---|
226.66 | 298.15 | Chhor, Pommier, et al., 1981 | T = 5 to 300 K. |

References

Chhor, Pommier, et al., 1981
Chhor, K.; Pommier, C.; Berar, J.F.; Calvarin, G.,
Thermodynamic and x-ray studies on arene chromium carbonyls,
Mol. Cryst. Liq. Cryst., 1981, 71, 3-18. [all data]