2-Hydroxy-1-naphthylphenyl ketone
- Formula: C17H12O2
- Molecular weight: 248.2760
- IUPAC Standard InChIKey: QWQNERTZFZXGFS-UHFFFAOYSA-N
- CAS Registry Number: 6333-07-9
- Chemical structure:
View 3d structure (requires JavaScript / HTML 5) - Other names: 1-Benzoyl-2-naphthol

Phase change data

Data compiled as indicated in comments:
TRC - Thermodynamics Research Center, NIST Boulder Laboratories, Chris Muzny director
AC - William E. Acree, Jr., James S. Chickos
Quantity | Value | Units | Method | Reference | Comment |
---|---|---|---|---|---|
Tfus | 414.05 | K | N/A | Domanska, 1990 | Uncertainty assigned by TRC = 0.1 K; TRC |
Enthalpy of fusion
ΔfusH (kJ/mol) | Temperature (K) | Method | Reference | Comment |
---|---|---|---|---|
31.35 | 414.1 | DSC | Acree, 1991 | AC |

References

Domanska, 1990
Domanska, U.,
Solubility of benzoyl-substituted naphthols in mixtures of hexane and 1-butanol,
Ind. Eng. Chem. Res., 1990, 29, 470. [all data]
Acree, 1991
Acree, William E.,
Thermodynamic properties of organic compounds: enthalpy of fusion and melting point temperature compilation,
Thermochimica Acta, 1991, 189, 1, 37-56, https://doi.org/10.1016/0040-6031(91)87098-H
. [all data]