2,4,6,8,9,10-Hexathiatricyclo[3.3.1.1(3,7)]decane, 1,3,5,7-tetramethylll-

Condensed phase thermochemistry data

Data compiled by: Eugene S. Domalski and Elizabeth D. Hearing

Quantity Value Units Method Reference Comment
solid,1 bar321.12J/mol*KN/AChang and Westrum, 1962

Constant pressure heat capacity of solid

Cp,solid (J/mol*K) Temperature (K) Reference Comment
301.62298.15Chang and Westrum, 1962T = 5 to 300 K.

References

Chang and Westrum, 1962
Chang, S.-S.; Westrum, E.F., Jr., Heat capacities and thermodynamic properties of globular molecules. III. Two methyl-substituted polythiaadamantanes, Ber. Bunsenges. Phys. Chem., 1962, 66, 524-527. [all data]