Hydrazine, tetraphenyl-
- Formula: C24H20N2
- Molecular weight: 336.4290
- IUPAC Standard InChIKey: KRMMZNOTUOIFQX-UHFFFAOYSA-N
- CAS Registry Number: 632-52-0
- Chemical structure:
View 3d structure (requires JavaScript / HTML 5) - Other names: Tetraphenylhydrazine

Condensed phase thermochemistry data

Data compiled by: Hussein Y. Afeefy, Joel F. Liebman, and Stephen E. Stein
Quantity | Value | Units | Method | Reference | Comment |
---|---|---|---|---|---|
ΔfH°solid | 452.7 | kJ/mol | Ccb | Medard, 1955 | At 18 C |
ΔfH°solid | 457.9 ± 2.6 | kJ/mol | Cm | Cole and Gilbert, 1951 | Reanalyzed by Cox and Pilcher, 1970, Original value = 456.9 kJ/mol |
Quantity | Value | Units | Method | Reference | Comment |
ΔcH°solid | -12755.5 ± 2.8 | kJ/mol | Ccb | Medard, 1955 | At 18 C |
ΔcH°solid | -12760.4 ± 2.5 | kJ/mol | Cm | Cole and Gilbert, 1951 | Reanalyzed by Cox and Pilcher, 1970, Original value = -12760. kJ/mol |
ΔcH°solid | -12752.7 ± 6.3 | kJ/mol | Ccb | Anderson and Gilbert, 1942 |

References

Medard, 1955
Medard, L.,
La chaleur de combustion de la diphenylamine et l'energie de la liaison n - n,
J. Chem. Phys., 1955, 52, 467-472. [all data]
Cole and Gilbert, 1951
Cole, L.G.; Gilbert, E.C.,
The heats of combustion of some nitrogen compounds and the apparent energy of the N-N bond,
J. Am. Chem. Soc., 1951, 73, 5423-5427. [all data]
Cox and Pilcher, 1970
Cox, J.D.; Pilcher, G.,
Thermochemistry of Organic and Organometallic Compounds, Academic Press, New York, 1970, 1-636. [all data]
Anderson and Gilbert, 1942
Anderson, C.M.; Gilbert, E.C.,
The apparent energy of the N-N bond as calculated from heats of combustion,
J. Am. Chem. Soc., 1942, 64, 2369-2372. [all data]