Benzene, 1,1',1'',1'''-(1,2-ethenediylidene)tetrakis-
- Formula: C26H20
- Molecular weight: 332.4370
- IUPAC Standard InChIKey: JLZUZNKTTIRERF-UHFFFAOYSA-N
- CAS Registry Number: 632-51-9
- Chemical structure:
View 3d structure (requires JavaScript / HTML 5) - Other names: Ethylene, tetraphenyl-; Tetraphenylethene; Tetraphenylethylene; 1,1,2,2-Tetraphenylethylene; α,β-Diphenylstilbene; 1,1,2,2-Tetraphenylethene

Condensed phase thermochemistry data

Data compiled as indicated in comments:
ALS - Hussein Y. Afeefy, Joel F. Liebman, and Stephen E. Stein
DH - Eugene S. Domalski and Elizabeth D. Hearing
Quantity | Value | Units | Method | Reference | Comment |
---|---|---|---|---|---|
ΔcH°solid | -13401.1 ± 1.3 | kJ/mol | Ccb | Coops and Hoijtink, 1950 | Reanalyzed by Cox and Pilcher, 1970, Original value = -13395.6 ± 0.60 kJ/mol; Corresponding ΔfHºsolid = 311.5 kJ/mol (simple calculation by NIST; no Washburn corrections); ALS |
Constant pressure heat capacity of solid
Cp,solid (J/mol*K) | Temperature (K) | Reference | Comment |
---|---|---|---|
387.6 | 298.5 | Smith and Andrews, 1931 | T = 102 to 346 K. Value is unsmoothed experimental datum.; DH |

Phase change data

Data compiled as indicated in comments:
BS - Robert L. Brown and Stephen E. Stein
TRC - Thermodynamics Research Center, NIST Boulder Laboratories, Chris Muzny director
AC - William E. Acree, Jr., James S. Chickos
Quantity | Value | Units | Method | Reference | Comment |
---|---|---|---|---|---|
Tboil | 693.2 | K | N/A | Weast and Grasselli, 1989 | BS |
Quantity | Value | Units | Method | Reference | Comment |
Tfus | 497. ± 4. | K | AVG | N/A | Average of 9 values; Individual data points |
Quantity | Value | Units | Method | Reference | Comment |
ΔsubH° | 133.4 ± 0.7 | kJ/mol | GS | Verevkin and Ebenhoch, 1999 | AC |
Enthalpy of sublimation
ΔsubH (kJ/mol) | Temperature (K) | Method | Reference | Comment |
---|---|---|---|---|
129.3 ± 0.7 | 366. | GS | Verevkin and Ebenhoch, 1999 | Based on data from 343. to 389. K.; AC |
Enthalpy of fusion
ΔfusH (kJ/mol) | Temperature (K) | Method | Reference | Comment |
---|---|---|---|---|
37.45 | 496.1 | DSC | Verevkin and Ebenhoch, 1999 | AC |

Kovats' RI, non-polar column, custom temperature program

Column type | Active phase | I | Reference | Comment |
---|---|---|---|---|
Packed | SE-30 | 2478. | Ramsey, Lee, et al., 1980 | He, Chromosorb G HP (80-100 mesh); Column length: 1.5 m; Program: not specified |

Normal alkane RI, non-polar column, custom temperature program

Column type | Active phase | I | Reference | Comment |
---|---|---|---|---|
Capillary | OV-1, SE-30, Methyl silicone, SP-2100, OV-101, DB-1, etc. | 2478. | Waggott and Davies, 1984 | Hydrogen; Column length: 50. m; Column diameter: 0.32 mm; Program: not specified |
Other | Methyl Silicone | 2478. | Ardrey and Moffat, 1981 | Program: not specified |

References

Coops and Hoijtink, 1950
Coops, J.; Hoijtink, G.J.,
Thermochemical investigations on arylethenes. I. Heats of combustion of phenylethenes,
Recl. Trav. Chim. Pays-Bas, 1950, 69, 358-367. [all data]
Cox and Pilcher, 1970
Cox, J.D.; Pilcher, G.,
Thermochemistry of Organic and Organometallic Compounds, Academic Press, New York, 1970, 1-636. [all data]
Smith and Andrews, 1931
Smith, R.H.; Andrews, D.H.,
Thermal energy studies. I. Phenyl derivatives of methane,
ethane and some related compounds. J. Am. Chem. Soc., 1931, 53, 3644-3660. [all data]
Weast and Grasselli, 1989
CRC Handbook of Data on Organic Compounds, 2nd Editon, Weast,R.C and Grasselli, J.G., ed(s)., CRC Press, Inc., Boca Raton, FL, 1989, 1. [all data]
Verevkin and Ebenhoch, 1999
Verevkin, Sergey P.; Ebenhoch, Jochen,
Structural Chemistry, 1999, 10, 6, 401-409, https://doi.org/10.1023/A:1022470804409
. [all data]
Suzuki, 1960
Suzuki, H.,
The ultraviolet absorption spectra of stilbene and some related compounds in the solid state measured by the pressed KCl disk technique,
Bull. Chem. Soc. Jpn., 1960, 33, 7, 944-952. [all data]
Ramsey, Lee, et al., 1980
Ramsey, J.D.; Lee, T.D.; Osselton, M.D.; Moffat, A.C.,
Gas-liquid chromatographic retention indices of 296 non-drug substances on SE-30 or OV-1 likely to be encountered in toxicological analyses,
J. Chromatogr., 1980, 184, 2, 185-206, https://doi.org/10.1016/S0021-9673(00)85641-1
. [all data]
Waggott and Davies, 1984
Waggott, A.; Davies, I.W.,
Identification of organic pollutants using linear temperature programmed retention indices (LTPRIs) - Part II, 1984, retrieved from http://dwi.defra.gov.uk/research/completed-research/reports/dwi0383.pdf. [all data]
Ardrey and Moffat, 1981
Ardrey, R.E.; Moffat, A.C.,
Gas-liquid chromatographic retention indices of 1318 substances of toxicological interest on SE-30 or OV-1 stationary phase,
J. Chromatogr., 1981, 220, 3, 195-252, https://doi.org/10.1016/S0021-9673(00)81925-1
. [all data]