Benzene, 1,1',1'',1'''-(1,2-ethanediylidene)tetrakis-
- Formula: C26H22
- Molecular weight: 334.4529
- IUPAC Standard InChIKey: RUGHUJBHQWALKM-UHFFFAOYSA-N
- CAS Registry Number: 632-50-8
- Chemical structure:
View 3d structure (requires JavaScript / HTML 5) - Other names: Ethane, 1,1,2,2-tetraphenyl-; α,α,β,β-Tetraphenylethane; sym-Tetraphenylethane; Bibenzhydryl; 1,1,2,2-Tetraphenylethane

Condensed phase thermochemistry data

Data compiled as indicated in comments:
ALS - Hussein Y. Afeefy, Joel F. Liebman, and Stephen E. Stein
DH - Eugene S. Domalski and Elizabeth D. Hearing
Quantity | Value | Units | Method | Reference | Comment |
---|---|---|---|---|---|
ΔfH°solid | 220. ± 3. | kJ/mol | Ccb | Beckhaus, Dogan, et al., 1990 | ALS |
Quantity | Value | Units | Method | Reference | Comment |
ΔcH°solid | -13596. ± 3. | kJ/mol | Ccb | Beckhaus, Dogan, et al., 1990 | Corresponding ΔfHºsolid = 220. kJ/mol (simple calculation by NIST; no Washburn corrections); ALS |
ΔcH°solid | -13591.4 ± 1.3 | kJ/mol | Ccb | Coops, Mulder, et al., 1953 | Reanalyzed by Cox and Pilcher, 1970, Original value = -13595. ± 3. kJ/mol; See Coops, Mulder, et al., 1946; Corresponding ΔfHºsolid = 216.0 kJ/mol (simple calculation by NIST; no Washburn corrections); ALS |
Constant pressure heat capacity of solid
Cp,solid (J/mol*K) | Temperature (K) | Reference | Comment |
---|---|---|---|
399.6 | 298.5 | Smith and Andrews, 1931 | T = 102 to 346 K. Value is unsmoothed experimental datum.; DH |

Phase change data

Data compiled as indicated in comments:
TRC - Thermodynamics Research Center, NIST Boulder Laboratories, Chris Muzny director
ALS - Hussein Y. Afeefy, Joel F. Liebman, and Stephen E. Stein
DRB - Donald R. Burgess, Jr.
AC - William E. Acree, Jr., James S. Chickos
Quantity | Value | Units | Method | Reference | Comment |
---|---|---|---|---|---|
Tfus | 485. ± 4. | K | AVG | N/A | Average of 9 values; Individual data points |
Quantity | Value | Units | Method | Reference | Comment |
ΔsubH° | 137. | kJ/mol | V | Beckhaus, Dogan, et al., 1990 | ALS |
ΔsubH° | 137.0 | kJ/mol | N/A | Beckhaus, Dogan, et al., 1990 | DRB |
ΔsubH° | 136.8 ± 2.9 | kJ/mol | GS | Beckhaus, Dogan, et al., 1990 | AC |
Enthalpy of sublimation
ΔsubH (kJ/mol) | Temperature (K) | Method | Reference | Comment |
---|---|---|---|---|
131.4 ± 2.1 | 396. | GS | Beckhaus, Dogan, et al., 1990 | Based on data from 370. to 423. K.; AC |

References

Beckhaus, Dogan, et al., 1990
Beckhaus, H.D.; Dogan, B.; Schaetzer, J.; Hellmann, S.; Ruchardt, C.,
Thermische stabilitat und bildungsenthalpie von 1,2,2,2- und 1,1,1,2- tetraphenylethan. - Die stabilisierungsenergien von benzhydryl- und triphenylmethyl-radikalen,
Chem. Ber., 1990, 123, 137-144. [all data]
Coops, Mulder, et al., 1953
Coops, J.; Mulder, D.; Dienske, J.W.; Smittenberg, J.,
Thermochemical investigations on arylethanes I. Heats of combustion of phenylethanes.,
Rec. Trav. Chim. Pays/Bas, 1953, 72, 785. [all data]
Cox and Pilcher, 1970
Cox, J.D.; Pilcher, G.,
Thermochemistry of Organic and Organometallic Compounds, Academic Press, New York, 1970, 1-636. [all data]
Coops, Mulder, et al., 1946
Coops, J.; Mulder, D.; Dienske, J.W.; Smittenberg, J.,
The heats of combustion of a number of hydrocarbons,
Rec. Trav. Chim. Pays/Bas, 1946, 65, 128. [all data]
Smith and Andrews, 1931
Smith, R.H.; Andrews, D.H.,
Thermal energy studies. I. Phenyl derivatives of methane,
ethane and some related compounds. J. Am. Chem. Soc., 1931, 53, 3644-3660. [all data]