D-Gulonic acid γ-lactone

Phase change data

Data compiled by: William E. Acree, Jr., James S. Chickos

Enthalpy of fusion

ΔfusH (kJ/mol) Temperature (K) Reference
40.13459.3Flores and Amador, 2004

References

Flores and Amador, 2004
Flores, Henoc; Amador, Patricia, Standard molar enthalpies of formation of crystalline stereoisomers of aldono-1,4-lactones, The Journal of Chemical Thermodynamics, 2004, 36, 11, 1019-1024, https://doi.org/10.1016/j.jct.2004.07.007 . [all data]