Isoserine
- Formula: C3H7NO3
- Molecular weight: 105.0926
- IUPAC Standard InChIKey: BMYNFMYTOJXKLE-UHFFFAOYSA-N
- CAS Registry Number: 632-12-2
- Chemical structure:
View 3d structure (requires JavaScript / HTML 5) - Other names: 2-Hydroxy-β-alanine; 2-Hydroxy-3-aminopropanoic acid; Propanoic acid, 3-amino-2-hydroxy-

Condensed phase thermochemistry data

Data compiled by: Hussein Y. Afeefy, Joel F. Liebman, and Stephen E. Stein
Quantity | Value | Units | Method | Reference | Comment |
---|---|---|---|---|---|
ΔcH°solid | -1440.7 ± 0.4 | kJ/mol | Ccb | Wrede, 1911 | |
ΔcH°solid | -1441. | kJ/mol | Ccb | Fischer and Wrede, 1904 | Heat of combustion corrected for pressure |
ΔcH°solid | -1440.1 | kJ/mol | Ccb | Lemoult, 1904 |

References

Wrede, 1911
Wrede, F.,
Uber die Bestimmung von Berbrennungswarmen mittels der kalorimetrischen Bombe unter Benutzung des Platinwiderstandsthermometers,
Z. Phys. Chem. (Leipzig), 1911, 81-94. [all data]
Fischer and Wrede, 1904
Fischer, E.; Wrede, F.,
Uber die Verbrennungswarme einiger organischer Verbindungen,
Sitzungsber. Dtsch. Akad. Wiss. Berlin Kl. Math. Phys. Tech., 1904, 687-715. [all data]
Lemoult, 1904
Lemoult, M.P.,
Remarques sur une serie recenie de determinations calorimetriques,
Compt. Rend., 1904, 663-635. [all data]