1,2,3-tribromobutane
- Formula: C4H7Br3
- Molecular weight: 294.810
- IUPAC Standard InChIKey: HKTNRDJXZCCMGH-UHFFFAOYSA-N
- CAS Registry Number: 632-05-3
- Chemical structure:
View 3d structure (requires JavaScript / HTML 5) - Permanent link for this species. Use this link for bookmarking this species for future reference.

Phase change data

Data compiled by: William E. Acree, Jr., James S. Chickos
Enthalpy of vaporization
ΔvapH (kJ/mol) | Temperature (K) | Method | Reference | Comment |
---|---|---|---|---|
54.1 | 409. | A | Stephenson and Malanowski, 1987 | Based on data from 394. to 546. K. See also Dykyj, 1971. |
51.3 | 333. | N/A | Stull, 1947 | Based on data from 318. to 489. K. |

References

Stephenson and Malanowski, 1987
Stephenson, Richard M.; Malanowski, Stanislaw,
Handbook of the Thermodynamics of Organic Compounds, 1987, https://doi.org/10.1007/978-94-009-3173-2
. [all data]
Dykyj, 1971
Dykyj, J.,
Petrochemia, 1971, 11, 2, 27. [all data]
Stull, 1947
Stull, Daniel R.,
Vapor Pressure of Pure Substances. Organic and Inorganic Compounds,
Ind. Eng. Chem., 1947, 39, 4, 517-540, https://doi.org/10.1021/ie50448a022
. [all data]