Butane, 2-chloro-3-methyl-
- Formula: C5H11Cl
- Molecular weight: 106.594
- IUPAC Standard InChIKey: JMTRCXPSDMMAGM-UHFFFAOYSA-N
- CAS Registry Number: 631-65-2
- Chemical structure:
View 3d structure (requires JavaScript / HTML 5) - Other names: 2-Chloro-3-methylbutane; (+/-)-2-Chloro-3-methyl-butane

Phase change data

Data compiled as indicated in comments:
TRC - Thermodynamics Research Center, NIST Boulder Laboratories, Chris Muzny director
AC - William E. Acree, Jr., James S. Chickos
Quantity | Value | Units | Method | Reference | Comment |
---|---|---|---|---|---|
Tboil | 366.15 | K | N/A | Hass, McBee, et al., 1935 | Uncertainty assigned by TRC = 1. K; TRC |
Enthalpy of vaporization
ΔvapH (kJ/mol) | Temperature (K) | Method | Reference | Comment |
---|---|---|---|---|
35.9 | 300. | A | Stephenson and Malanowski, 1987 | Based on data from 285. to 405. K. See also Dykyj, 1972.; AC |

Reaction thermochemistry data

Data compiled by: Hussein Y. Afeefy, Joel F. Liebman, and Stephen E. Stein
Individual Reactions
By formula: C5H11Cl = C5H11Cl
Quantity | Value | Units | Method | Reference | Comment |
---|---|---|---|---|---|
ΔrH° | 9.12 | kJ/mol | Eqk | Esipenok, Kabo, et al., 1973 | liquid phase; solvent: liquid phase |
ΔrH° | 7.9 ± 0.2 | kJ/mol | Eqk | Esipenok, Kabo, et al., 1973 | liquid phase; solvent: cyclohexane |

Normal alkane RI, non-polar column, isothermal

Column type | Active phase | Temperature (C) | I | Reference | Comment |
---|---|---|---|---|---|
Capillary | Apiezon L | 130. | 662. | Arruda, Junkes, et al., 2008 | |
Capillary | Squalane | 30. | 668. | Tourres, 1968 | Nitrogen; Column length: 50. m; Column diameter: 0.25 mm |
Capillary | Squalane | 50. | 672. | Tourres, 1968 | Nitrogen; Column length: 50. m; Column diameter: 0.25 mm |

Normal alkane RI, non-polar column, custom temperature program

Column type | Active phase | I | Reference | Comment |
---|---|---|---|---|
Capillary | Methyl Silicone | 684. | Zenkevich, 1999 | Program: not specified |

References

Hass, McBee, et al., 1935
Hass, H.B.; McBee, E.T.; Weber, P.,
Ind. Eng. Chem., 1935, 27, 1190. [all data]
Stephenson and Malanowski, 1987
Stephenson, Richard M.; Malanowski, Stanislaw,
Handbook of the Thermodynamics of Organic Compounds, 1987, https://doi.org/10.1007/978-94-009-3173-2
. [all data]
Dykyj, 1972
Dykyj, J.,
Petrochemia, 1972, 12, 1, 13. [all data]
Esipenok, Kabo, et al., 1973
Esipenok, G.E.; Kabo, G.Ya.; Andreevskii, D.N.,
Equilibrium and thermodynamics of the isomerisation of methylchlorobutanes,
Russ. J. Phys. Chem. (Engl. Transl.), 1973, 47, 420. [all data]
Arruda, Junkes, et al., 2008
Arruda, A.C.S.; Junkes, B. da.S.; Souza, E.S.; Yunes, R.A.; Heizen, V.E.F.,
Semi-Emlirical Topological Index to Predict Properties of Halogenated Aliphatic Compounds,
J. Chemometrics, 2008, 22, 3-4, 186-194, https://doi.org/10.1002/cem.1121
. [all data]
Tourres, 1968
Tourres, D.A.,
Separation of mono- and dichloro-methyl butanes and of monochloro-methyl butenes by preparative gas chromatography,
Chromatographia, 1968, 1, 11-12, 437-442, https://doi.org/10.1007/BF02255759
. [all data]
Zenkevich, 1999
Zenkevich, I.G.,
Mutual Correlation between Gas-Chromatographic Retention Indices of Organic Compounds from Different Series,
Zh. Anal. Khim., 1999, 54, 12, 1272-1279. [all data]