Tetrapropylammonium iodide
- Formula: C12H28IN
- Molecular weight: 313.2619
- IUPAC Standard InChIKey: GKXDJYKZFZVASJ-UHFFFAOYSA-M
- CAS Registry Number: 631-40-3
- Chemical structure:
View 3d structure (requires JavaScript / HTML 5) - Other names: tetra-n-Propylammonium iodide; 1-Propanaminium, N,N,N-tripropyl-, iodide; Ammonium, tetrapropyl-, iodide

Condensed phase thermochemistry data

Data compiled by: Eugene S. Domalski and Elizabeth D. Hearing
Quantity | Value | Units | Method | Reference | Comment |
---|---|---|---|---|---|
S°solid,1 bar | 432.2 | J/mol*K | N/A | Johnson and Martin, 1973 |
Constant pressure heat capacity of solid
Cp,solid (J/mol*K) | Temperature (K) | Reference | Comment |
---|---|---|---|
349.4 | 298.15 | Johnson and Martin, 1973 | T = 12 to 310 K. |

Phase change data

Data compiled by: Eugene S. Domalski and Elizabeth D. Hearing
Enthalpy of phase transition
ΔHtrs (kJ/mol) | Temperature (K) | Initial Phase | Final Phase | Reference | Comment |
---|---|---|---|---|---|
1.350 | 218.3 | crystaline, II | crystaline, I | Johnson and Martin, 1973 |
Entropy of phase transition
ΔStrs (J/mol*K) | Temperature (K) | Initial Phase | Final Phase | Reference | Comment |
---|---|---|---|---|---|
6.19 | 218.3 | crystaline, II | crystaline, I | Johnson and Martin, 1973 |

References

Johnson and Martin, 1973
Johnson, D.A.; Martin, J.F.,
Thermodynamic properties of tetra-alkylammonium ions in aqueous solution,
J. Chem. Soc. Dalton, 1973, 1973, 1585-1590. [all data]