Naphthalene, 2-butyldecahydro-
- Formula: C14H26
- Molecular weight: 194.3562
- IUPAC Standard InChIKey: VYMIQGUNEIJWAR-UHFFFAOYSA-N
- CAS Registry Number: 6305-52-8
- Chemical structure:
View 3d structure (requires JavaScript / HTML 5) - Stereoisomers:
- Other names: 2-n-Butyldecahydronaphthalene; 3-n-Butylbicyclo(4.4.0)decane; 2-Butyldecalin, trans; 3-butylbicyclo[4.4.0]decane

Normal alkane RI, non-polar column, isothermal

Column type | Active phase | Temperature (C) | I | Reference | Comment |
---|---|---|---|---|---|
Packed | Polydimethyl siloxane | 147. | 1432. | Ferrand, 1962 |

References

Ferrand, 1962
Ferrand, R.,
Gas phase chromatography using retention indices for the analysis of tars and their hydrogenation products,
Journees internationales d'etude des methodes de separation immediate at de chromatographie; Org. sur l'initiative du IX., 1962, 132-140. [all data]