Pentatriacontane
- Formula: C35H72
- Molecular weight: 492.9462
- IUPAC Standard InChIKey: VHQQPFLOGSTQPC-UHFFFAOYSA-N
- CAS Registry Number: 630-07-9
- Chemical structure:
View 3d structure (requires JavaScript / HTML 5) - Other names: n-Pentatriacontane; n-Pentatriacotane

Condensed phase thermochemistry data

Data compiled by: Eugene S. Domalski and Elizabeth D. Hearing
Constant pressure heat capacity of solid
Cp,solid (J/mol*K) | Temperature (K) | Reference | Comment |
---|---|---|---|
915.9 | 302. | Garner, Van Bibber, et al., 1931 | crystaline, II phase; T = 290 to 373 K. Mean value, 17 to 41°C. |

Phase change data

Data compiled as indicated in comments:
BS - Robert L. Brown and Stephen E. Stein
TRC - Thermodynamics Research Center, NIST Boulder Laboratories, Chris Muzny director
AC - William E. Acree, Jr., James S. Chickos
CAL - James S. Chickos, William E. Acree, Jr., Joel F. Liebman, Students of Chem 202 (Introduction to the Literature of Chemistry), University of Missouri -- St. Louis
DH - Eugene S. Domalski and Elizabeth D. Hearing
Quantity | Value | Units | Method | Reference | Comment |
---|---|---|---|---|---|
Tboil | 763.2 | K | N/A | Weast and Grasselli, 1989 | BS |
Quantity | Value | Units | Method | Reference | Comment |
Tfus | 348. ± 2. | K | AVG | N/A | Average of 17 values; Individual data points |
Quantity | Value | Units | Method | Reference | Comment |
ΔvapH° | 178. | kJ/mol | CGC | Chickos and Hanshaw, 2004 | Based on data from 534. to 565. K.; AC |
Reduced pressure boiling point
Tboil (K) | Pressure (bar) | Reference | Comment |
---|---|---|---|
584.2 | 0.013 | Weast and Grasselli, 1989 | BS |
Enthalpy of vaporization
ΔvapH (kJ/mol) | Temperature (K) | Method | Reference | Comment |
---|---|---|---|---|
122.4 | 544. | A,E | Stephenson and Malanowski, 1987 | Based on data from 529. to 764. K. See also Kudchadker and Zwolinski, 1966.; AC |
Enthalpy of fusion
ΔfusH (kJ/mol) | Temperature (K) | Reference | Comment |
---|---|---|---|
86.4 | 347.2 | Domalski and Hearing, 1996 | AC |
Entropy of fusion
ΔfusS (J/mol*K) | Temperature (K) | Reference | Comment |
---|---|---|---|
119.2 | 344.7 | Domalski and Hearing, 1996 | CAL |
248.85 | 347.2 |
Enthalpy of phase transition
ΔHtrs (kJ/mol) | Temperature (K) | Initial Phase | Final Phase | Reference | Comment |
---|---|---|---|---|---|
41.087 | 344.7 | crystaline, II | crystaline, I | Garner, Van Bibber, et al., 1931 | DH |
86.400 | 347.2 | crystaline, I | liquid | Garner, Van Bibber, et al., 1931 | DH |
Entropy of phase transition
ΔStrs (J/mol*K) | Temperature (K) | Initial Phase | Final Phase | Reference | Comment |
---|---|---|---|---|---|
119.2 | 344.7 | crystaline, II, á | crystaline, I, à transition | Garner, Van Bibber, et al., 1931 | DH |
248.8 | 347.2 | crystaline, I | liquid | Garner, Van Bibber, et al., 1931 | DH |

References

Garner, Van Bibber, et al., 1931
Garner, W.E.; Van Bibber, K.; King, A.M.,
The melting points and heats of crystallization of the normal long-chain hydrocarbons,
J. Chem. Soc. (London), 1931, 1931, 1533-1541. [all data]
Weast and Grasselli, 1989
CRC Handbook of Data on Organic Compounds, 2nd Editon, Weast,R.C and Grasselli, J.G., ed(s)., CRC Press, Inc., Boca Raton, FL, 1989, 1. [all data]
Chickos and Hanshaw, 2004
Chickos, James S.; Hanshaw, William,
Vapor Pressures and Vaporization Enthalpies of the n -Alkanes from C 31 to C 38 at T = 298.15 K by Correlation Gas Chromatography,
J. Chem. Eng. Data, 2004, 49, 3, 620-630, https://doi.org/10.1021/je030236t
. [all data]
Stephenson and Malanowski, 1987
Stephenson, Richard M.; Malanowski, Stanislaw,
Handbook of the Thermodynamics of Organic Compounds, 1987, https://doi.org/10.1007/978-94-009-3173-2
. [all data]
Kudchadker and Zwolinski, 1966
Kudchadker, A.P.; Zwolinski, B.J.,
Vapor Pressure and Boiling Points of Normal Alkanes, C 21 to C 100 .,
J. Chem. Eng. Data, 1966, 11, 2, 253-255, https://doi.org/10.1021/je60029a039
. [all data]
Domalski and Hearing, 1996
Domalski, Eugene S.; Hearing, Elizabeth D.,
Heat Capacities and Entropies of Organic Compounds in the Condensed Phase. Volume III,
J. Phys. Chem. Ref. Data, 1996, 25, 1, 1, https://doi.org/10.1063/1.555985
. [all data]