Hentriacontane
- Formula: C31H64
- Molecular weight: 436.8399
- IUPAC Standard InChIKey: IUJAMGNYPWYUPM-UHFFFAOYSA-N
- CAS Registry Number: 630-04-6
- Chemical structure:
View 3d structure (requires JavaScript / HTML 5) - Other names: n-Hentriacontane; Untriacontane

Condensed phase thermochemistry data

Data compiled by: Eugene S. Domalski and Elizabeth D. Hearing
Constant pressure heat capacity of solid
Cp,solid (J/mol*K) | Temperature (K) | Reference | Comment |
---|---|---|---|
912. | 323. | Verdonk, 1938 | crystaline, β phase; Also data for α form, 1774 J/mol*K at 338 K, and liquid 1096 J/mol*K at 348 K. |

Phase change data

Data compiled as indicated in comments:
TRC - Thermodynamics Research Center, NIST Boulder Laboratories, Chris Muzny director
AC - William E. Acree, Jr., James S. Chickos
Quantity | Value | Units | Method | Reference | Comment |
---|---|---|---|---|---|
Tfus | 341.5 ± 0.9 | K | AVG | N/A | Average of 18 values; Individual data points |
Quantity | Value | Units | Method | Reference | Comment |
ΔvapH° | 157.3 | kJ/mol | CGC | Chickos and Hanshaw, 2004 | Based on data from 534. to 565. K.; AC |
Enthalpy of vaporization
ΔvapH (kJ/mol) | Temperature (K) | Method | Reference | Comment |
---|---|---|---|---|
146. ± 2. | 450. | TE | Piacente, Fontana, et al., 1994 | Based on data from 433. to 474. K.; AC |
113.8 | 518. | A,E | Stephenson and Malanowski, 1987 | Based on data from 503. to 732. K. See also Kudchadker and Zwolinski, 1966.; AC |

Lee's RI, non-polar column, temperature ramp

Column type | Active phase | I | Reference | Comment |
---|---|---|---|---|
Capillary | DB-5MS | 478.65 | Chen, Keeran, et al., 2002 | 30. m/0.25 mm/0.5 μm, 40. C @ 1. min, 4. K/min; Tend: 310. C |

Lee's RI, non-polar column, custom temperature program

Column type | Active phase | I | Reference | Comment |
---|---|---|---|---|
Capillary | DB-5 | 472.7 | Fuentes, Font, et al., 2007 | Column length: 60. m; Program: not specified |

References

Verdonk, 1938
Verdonk, G.,
Calorimetric analysis of paraffins - Contributions to the general subject of "calorimetric analysis" by J. Straub and R.N.M.A. Malataux,
Chem. Weekblad, 1938, 35, 741-743. [all data]
Chickos and Hanshaw, 2004
Chickos, James S.; Hanshaw, William,
Vapor Pressures and Vaporization Enthalpies of the n -Alkanes from C 31 to C 38 at T = 298.15 K by Correlation Gas Chromatography,
J. Chem. Eng. Data, 2004, 49, 3, 620-630, https://doi.org/10.1021/je030236t
. [all data]
Piacente, Fontana, et al., 1994
Piacente, Vincenzo; Fontana, Danilo; Scardala, Paolo,
Enthalpies of Vaporization of a Homologous Series of n-Alkanes Determined from Vapor Pressure Measurements,
J. Chem. Eng. Data, 1994, 39, 2, 231-237, https://doi.org/10.1021/je00014a009
. [all data]
Stephenson and Malanowski, 1987
Stephenson, Richard M.; Malanowski, Stanislaw,
Handbook of the Thermodynamics of Organic Compounds, 1987, https://doi.org/10.1007/978-94-009-3173-2
. [all data]
Kudchadker and Zwolinski, 1966
Kudchadker, A.P.; Zwolinski, B.J.,
Vapor Pressure and Boiling Points of Normal Alkanes, C 21 to C 100 .,
J. Chem. Eng. Data, 1966, 11, 2, 253-255, https://doi.org/10.1021/je60029a039
. [all data]
Chen, Keeran, et al., 2002
Chen, P.H.; Keeran, W.S.; Van Ausdale, W.A.; Schindler, D.R.; Roberts, D.W.,
Application of Lee retention indices to the confirmation of tentatively identified compounds from GC/MS analysis of environmental samples, Technical paper, Analytical Services Division, Environmental ScienceEngineering, Inc, PO Box 1703, Gainesville, FL 32602, 2002, 11. [all data]
Fuentes, Font, et al., 2007
Fuentes, M.J.; Font, R.; Gomez-Rico, M.F.; Martin-Gullon, I.,
Pyrolysis and combustion of waste lubricant oil from diesel cars: Decomposition and pollutants,
J. Anal. Appl. Pyrolysis, 2007, 79, 1-2, 215-226, https://doi.org/10.1016/j.jaap.2006.12.004
. [all data]