Octacosane
- Formula: C28H58
- Molecular weight: 394.7601
- IUPAC Standard InChIKey: ZYURHZPYMFLWSH-UHFFFAOYSA-N
- CAS Registry Number: 630-02-4
- Chemical structure:
View 3d structure (requires JavaScript / HTML 5) - Other names: n-Octacosane

Condensed phase thermochemistry data

Data compiled by: Eugene S. Domalski and Elizabeth D. Hearing
Constant pressure heat capacity of liquid
Cp,liquid (J/mol*K) | Temperature (K) | Reference | Comment |
---|---|---|---|
937. | 353. | Atkinson, Larkin, et al., 1969 | T = 353 to 453 K. Equation only. |

Phase change data

Data compiled as indicated in comments:
BS - Robert L. Brown and Stephen E. Stein
TRC - Thermodynamics Research Center, NIST Boulder Laboratories, Chris Muzny director
AC - William E. Acree, Jr., James S. Chickos
ALS - Hussein Y. Afeefy, Joel F. Liebman, and Stephen E. Stein
CAL - James S. Chickos, William E. Acree, Jr., Joel F. Liebman, Students of Chem 202 (Introduction to the Literature of Chemistry), University of Missouri -- St. Louis
DH - Eugene S. Domalski and Elizabeth D. Hearing
Quantity | Value | Units | Method | Reference | Comment |
---|---|---|---|---|---|
Tboil | 704.8 | K | N/A | Weast and Grasselli, 1989 | BS |
Quantity | Value | Units | Method | Reference | Comment |
Tfus | 334. ± 1. | K | AVG | N/A | Average of 23 out of 26 values; Individual data points |
Quantity | Value | Units | Method | Reference | Comment |
Ttriple | 333.98 | K | N/A | Domanska and Wyrzykowska-Stankiewicz, 1991 | Crystal phase 1 phase; Uncertainty assigned by TRC = 0.7 K; TRC |
Quantity | Value | Units | Method | Reference | Comment |
ΔvapH° | 141.9 | kJ/mol | CGC | Chickos and Hanshaw, 2004 | Based on data from 434. to 539. K.; AC |
ΔvapH° | 150.8 ± 0.5 | kJ/mol | CGC | Chickos, Webb, et al., 2002 | AC |
ΔvapH° | 150.7 ± 1.7 | kJ/mol | CGC | Nichols, Orf, et al., 2000 | AC |
ΔvapH° | 152.4 ± 2.9 | kJ/mol | CGC | Chickos and Wilson, 1997 | AC |
Quantity | Value | Units | Method | Reference | Comment |
ΔsubH° | 209. ± 10. | kJ/mol | B | Piacente, Pompili, et al., 1991 | AC |
Reduced pressure boiling point
Tboil (K) | Pressure (bar) | Reference | Comment |
---|---|---|---|
551.2 | 0.020 | Aldrich Chemical Company Inc., 1990 | BS |
Enthalpy of vaporization
ΔvapH (kJ/mol) | Temperature (K) | Method | Reference | Comment |
---|---|---|---|---|
117.4 ± 1.2 | 376. | N/A | Razzouk, Naccoul, et al., 2009 | Based on data from 339. to 412. K.; AC |
118.5 | 369. | GC | Mokbel, Razzouk, et al., 2007 | Based on data from 354. to 517. K.; AC |
100.5 | 498. | N/A | Morgan and Kobayashi, 1994 | Based on data from 483. to 588. K.; AC |
135. ± 3. | 431. | TE | Piacente, Fontana, et al., 1994 | Based on data from 407. to 456. K.; AC |
105.5 | 441. | TE,ME,GS | Piacente, Pompili, et al., 1991 | Based on data from 426. to 493. K.; AC |
103.1 ± 3.0 | 494. | GS | Piacente and Scardala, 1990 | Based on data from 473. to 515. K.; AC |
99.27 ± 0.06 | 510. | V | Chirico, Nguyen, et al., 1989 | ALS |
100.6 | 500. | EB,IP | Chirico, Nguyen, et al., 1989 | Based on data from 450. to 575. K.; AC |
98.1 | 560. | EB,IP | Chirico, Nguyen, et al., 1989 | Based on data from 450. to 575. K.; AC |
131.7 | 315. | A | Stephenson and Malanowski, 1987 | Based on data from 300. to 390. K.; AC |
106.6 | 496. | A,EST | Stephenson and Malanowski, 1987 | Based on data from 481. to 705. K. See also Kudchadker and Zwolinski, 1966.; AC |
Enthalpy of sublimation
ΔsubH (kJ/mol) | Temperature (K) | Reference | Comment |
---|---|---|---|
195.8 ± 2.2 | 326. | Razzouk, Naccoul, et al., 2009 | Based on data from 323. to 329. K.; AC |
Enthalpy of fusion
ΔfusH (kJ/mol) | Temperature (K) | Method | Reference | Comment |
---|---|---|---|---|
67.38 | 334.2 | DSC | Hafsaoui and Mahmoud, 2007 | AC |
63.0 | 333.4 | DSC | Mondieig, Rajabalee, et al., 2004 | AC |
64.64 | 334.5 | N/A | Domalski and Hearing, 1996 | AC |
Entropy of fusion
ΔfusS (J/mol*K) | Temperature (K) | Reference | Comment |
---|---|---|---|
106.98 | 331.3 | Domalski and Hearing, 1996 | CAL |
193.28 | 334.5 |
Enthalpy of phase transition
ΔHtrs (kJ/mol) | Temperature (K) | Initial Phase | Final Phase | Reference | Comment |
---|---|---|---|---|---|
33.675 | 330.7 | crystaline, II | crystaline, I | Claudy and Letoffe, 1991 | DH |
63.385 | 334.7 | crystaline, I | liquid | Claudy and Letoffe, 1991 | DH |
33.660 | 330.40 | crystaline, II | crystaline, I | Domanska and Wyrzykowska-Stankiewicz, 1991, 2 | DH |
66.520 | 333.98 | crystaline, I | liquid | Domanska and Wyrzykowska-Stankiewicz, 1991, 2 | DH |
35.438 | 331.25 | crystaline, II | crystaline, I | Company, 1973 | DH |
64.642 | 334.45 | crystaline, I | liquid | Company, 1973 | DH |
35.438 | 331.15 | crystaline, II | crystaline, I | Schaerer, Busso, et al., 1955 | DH |
64.643 | 334.35 | crystaline, I | liquid | Schaerer, Busso, et al., 1955 | DH |
Entropy of phase transition
ΔStrs (J/mol*K) | Temperature (K) | Initial Phase | Final Phase | Reference | Comment |
---|---|---|---|---|---|
107.0 | 331.25 | crystaline, II | crystaline, I | Company, 1973 | DH |
193.3 | 334.45 | crystaline, I | liquid | Company, 1973 | DH |
107.0 | 331.15 | crystaline, II | crystaline, I | Schaerer, Busso, et al., 1955 | DH |
193.3 | 334.35 | crystaline, I | liquid | Schaerer, Busso, et al., 1955 | DH |

Lee's RI, non-polar column, temperature ramp

Column type | Active phase | I | Reference | Comment |
---|---|---|---|---|
Capillary | DB-5MS | 442.42 | Chen, Keeran, et al., 2002 | 30. m/0.25 mm/0.5 μm, 40. C @ 1. min, 4. K/min; Tend: 310. C |
Capillary | DB-1 | 461.8 | Johnson, Urso, et al., 1997 | 30. m/0.2 mm/0.25 μm, 50. C @ 2. min, 5. K/min, 300. C @ 5. min |
Capillary | DB-1 | 461.8 | Johnson, Urso, et al., 1997 | 30. m/0.2 mm/0.25 μm, 50. C @ 2. min, 5. K/min, 300. C @ 5. min |

References

Atkinson, Larkin, et al., 1969
Atkinson, C.M.L.; Larkin, J.A.; Richardson, M.J.,
Enthalpy changes in molten n-alkanes and polyethylene,
J. Chem. Thermodynam., 1969, 1, 435-445. [all data]
Weast and Grasselli, 1989
CRC Handbook of Data on Organic Compounds, 2nd Editon, Weast,R.C and Grasselli, J.G., ed(s)., CRC Press, Inc., Boca Raton, FL, 1989, 1. [all data]
Domanska and Wyrzykowska-Stankiewicz, 1991
Domanska, U.; Wyrzykowska-Stankiewicz, D.,
Enthalpies of fusion and solid-solid transition of even-numbered paraffins docosane, hexacosane, octacosane and tetracosane,
Thermochim. Acta, 1991, 179, 265-71. [all data]
Chickos and Hanshaw, 2004
Chickos, James S.; Hanshaw, William,
Vapor Pressures and Vaporization Enthalpies of the n -Alkanes from C 21 to C 30 at T = 298.15 K by Correlation Gas Chromatography,
J. Chem. Eng. Data, 2004, 49, 1, 77-85, https://doi.org/10.1021/je0301747
. [all data]
Chickos, Webb, et al., 2002
Chickos, James S.; Webb, Paul; Nichols, Gary; Kiyobayashi, Tetsu; Cheng, Pei-Chao; Scott, Lawrence,
The enthalpy of vaporization and sublimation of corannulene, coronene, and perylene at T= 298.15 K,
The Journal of Chemical Thermodynamics, 2002, 34, 8, 1195-1206, https://doi.org/10.1006/jcht.2002.0977
. [all data]
Nichols, Orf, et al., 2000
Nichols, Gary; Orf, Jennifer; Reiter, Sarah M.; Chickos, James; Gokel, George W.,
The vaporization enthalpies of some crown and polyethers by correlation gas chromatography,
Thermochimica Acta, 2000, 346, 1-2, 15-28, https://doi.org/10.1016/S0040-6031(99)00405-0
. [all data]
Chickos and Wilson, 1997
Chickos, James S.; Wilson, Joe A.,
Vaporization Enthalpies at 298.15 K of the n -Alkanes from C 21 to C 28 and C 30,
J. Chem. Eng. Data, 1997, 42, 1, 190-197, https://doi.org/10.1021/je960089h
. [all data]
Piacente, Pompili, et al., 1991
Piacente, Vincenzo; Pompili, Tiziano; Scardala, Paolo; Ferro, Daniela,
Temperature dependence of the vaporization enthalpies of n-alkanes from vapour-pressure measurements,
The Journal of Chemical Thermodynamics, 1991, 23, 4, 379-396, https://doi.org/10.1016/S0021-9614(05)80092-8
. [all data]
Aldrich Chemical Company Inc., 1990
Aldrich Chemical Company Inc.,
Catalog Handbook of Fine Chemicals, Aldrich Chemical Company, Inc., Milwaukee WI, 1990, 1. [all data]
Razzouk, Naccoul, et al., 2009
Razzouk, Antonio; Naccoul, Ramy Abou; Mokbel, Ilham; Saab, Joseph; Jose, Jacques,
Vapor and Sublimation Pressures of Three Normal Alkanes: C 20 , C 24 , and C 28,
J. Chem. Eng. Data, 2009, 54, 4, 1214-1219, https://doi.org/10.1021/je800534x
. [all data]
Mokbel, Razzouk, et al., 2007
Mokbel, Ilham; Razzouk, Antonio; Hajjaji, Ahmed; Msakni, Nizar; Jose, Jacques,
A Gas Saturation Apparatus for Very Low Vapor or Sublimation Pressure Measurements (10 -3 Pa): Vapor-Liquid Equilibria of n -Alkanes ( n -C 10 , n -C 24 , n -C 28 ),
J. Chem. Eng. Data, 2007, 52, 5, 1720-1725, https://doi.org/10.1021/je7001122
. [all data]
Morgan and Kobayashi, 1994
Morgan, David L.; Kobayashi, Riki,
Direct vapor pressure measurements of ten n-alkanes m the 10-C28 range,
Fluid Phase Equilibria, 1994, 97, 211-242, https://doi.org/10.1016/0378-3812(94)85017-8
. [all data]
Piacente, Fontana, et al., 1994
Piacente, Vincenzo; Fontana, Danilo; Scardala, Paolo,
Enthalpies of Vaporization of a Homologous Series of n-Alkanes Determined from Vapor Pressure Measurements,
J. Chem. Eng. Data, 1994, 39, 2, 231-237, https://doi.org/10.1021/je00014a009
. [all data]
Piacente and Scardala, 1990
Piacente, Vincenzo; Scardala, Paolo,
Vaporization enthalpies and entropies of some n-alkanes,
Thermochimica Acta, 1990, 159, 193-200, https://doi.org/10.1016/0040-6031(90)80108-B
. [all data]
Chirico, Nguyen, et al., 1989
Chirico, R.D.; Nguyen, A.; Steele, W.V.; Strube, M.M.,
Vapor pressure of n-alkanes revisited. New high-precision vapor pressure data on n-decane, n-eicosane, and n-octacosane,
J. Chem. Eng. Data, 1989, 34, 149-156. [all data]
Stephenson and Malanowski, 1987
Stephenson, Richard M.; Malanowski, Stanislaw,
Handbook of the Thermodynamics of Organic Compounds, 1987, https://doi.org/10.1007/978-94-009-3173-2
. [all data]
Kudchadker and Zwolinski, 1966
Kudchadker, A.P.; Zwolinski, B.J.,
Vapor Pressure and Boiling Points of Normal Alkanes, C 21 to C 100 .,
J. Chem. Eng. Data, 1966, 11, 2, 253-255, https://doi.org/10.1021/je60029a039
. [all data]
Hafsaoui and Mahmoud, 2007
Hafsaoui, S.L.; Mahmoud, R.,
Solid-liquid equilibria of binary systems containing n-tetracosane with naphthalene or dibenzofuran,
J Therm Anal Calorim, 2007, 88, 2, 565-570, https://doi.org/10.1007/s10973-006-8084-2
. [all data]
Mondieig, Rajabalee, et al., 2004
Mondieig, D.; Rajabalee, F.; Metivaud, V.; Oonk, H.A.J.; Cuevas-Diarte, M.A.,
n -Alkane Binary Molecular Alloys,
Chem. Mater., 2004, 16, 5, 786-798, https://doi.org/10.1021/cm031169p
. [all data]
Domalski and Hearing, 1996
Domalski, Eugene S.; Hearing, Elizabeth D.,
Heat Capacities and Entropies of Organic Compounds in the Condensed Phase. Volume III,
J. Phys. Chem. Ref. Data, 1996, 25, 1, 1, https://doi.org/10.1063/1.555985
. [all data]
Claudy and Letoffe, 1991
Claudy, P.; Letoffe, J.M.,
Phase transitions in even n-alkanes CnH2n+2, n = 16-28. Characterization by differential calorimetric analysis and by thermooptical analysis. Effect of deuteration,
Calorim. Anal. Therm., 1991, 22, 281-290. [all data]
Domanska and Wyrzykowska-Stankiewicz, 1991, 2
Domanska, U.; Wyrzykowska-Stankiewicz, D.,
Enthalpies of fusion and solid-solid transition of even-numbered paraffins docosane, hexacosane, octacosane and tetracosane,
Thermochim. Acta, 1991, 179, 265-271. [all data]
Company, 1973
Company, J.C.,
Measurement and interpretation of crystallization equilibriums of heavy paraffin and aromatic hydrocarbon solutions,
Chem. Eng. Sci., 1973, 28, 318-323. [all data]
Schaerer, Busso, et al., 1955
Schaerer, A.A.; Busso, C.J.; Smith, A.E.; Skinner, L.B.,
Properties of pure normal alkanes in the C17 to C36 range,
J. Am. Chem. Soc., 1955, 77, 2017-2019. [all data]
Chen, Keeran, et al., 2002
Chen, P.H.; Keeran, W.S.; Van Ausdale, W.A.; Schindler, D.R.; Roberts, D.W.,
Application of Lee retention indices to the confirmation of tentatively identified compounds from GC/MS analysis of environmental samples, Technical paper, Analytical Services Division, Environmental ScienceEngineering, Inc, PO Box 1703, Gainesville, FL 32602, 2002, 11. [all data]
Johnson, Urso, et al., 1997
Johnson, C.I.; Urso, A.; Geleta, L.,
Broad spectrum analysis of municipal and industrial effluents discharged into the Peace, Athabasca and Slave river basins: characterization of effluent samples, 1994 - Volume 1 of 2, Northern River Basins Study Project Report No. 121, Norther River Basins Study, Edmonton, Alberta, 1997, 27. [all data]