pentane, 1,2-dibromo-4,4-dimethyl-
- Formula: C7H14Br2
- Molecular weight: 257.994
- IUPAC Standard InChIKey: WFQMMFFMGBXAOE-UHFFFAOYSA-N
- CAS Registry Number: 6300-00-1
- Chemical structure:
View 3d structure (requires JavaScript / HTML 5) - Permanent link for this species. Use this link for bookmarking this species for future reference.

Phase change data

Data compiled by: Thermodynamics Research Center, NIST Boulder Laboratories, Chris Muzny director
Quantity | Value | Units | Method | Reference | Comment |
---|---|---|---|---|---|
Tboil | 472. | K | N/A | Schmerling, 1946 | Uncertainty assigned by TRC = 5. K |

References

Schmerling, 1946
Schmerling, L.,
Condensation of Saturated Halides with Unsaturated Compounds II. The Condensation of ALkyl Halides with Monohaloolefins,
J. Am. Chem. Soc., 1946, 68, 1650-4. [all data]