Octane, 1,1'-oxybis-
- Formula: C16H34O
- Molecular weight: 242.4406
- IUPAC Standard InChIKey: NKJOXAZJBOMXID-UHFFFAOYSA-N
- CAS Registry Number: 629-82-3
- Chemical structure:
View 3d structure (requires JavaScript / HTML 5) - Other names: Octyl ether; n-Octyl ether; Antar; Caprylic ether; Di-n-octyl ether; Dioctyl ether; Ether, di-n-octyl-; 1-(Octyloxy)octane; 1,1'-Oxybisoctane; Dicaprylyl ether; NSC 28948

Phase change data

Data compiled as indicated in comments:
BS - Robert L. Brown and Stephen E. Stein
TRC - Thermodynamics Research Center, NIST Boulder Laboratories, Chris Muzny director
Quantity | Value | Units | Method | Reference | Comment |
---|---|---|---|---|---|
Tboil | 559.7 | K | N/A | Weast and Grasselli, 1989 | BS |
Tboil | 559.7 | K | N/A | Devaney and Panian, 1953 | Uncertainty assigned by TRC = 1.5 K; TRC |
Quantity | Value | Units | Method | Reference | Comment |
Tfus | 265.6 | K | N/A | Devaney and Panian, 1953 | Uncertainty assigned by TRC = 1. K; TRC |

Van Den Dool and Kratz RI, non-polar column, custom temperature program

Column type | Active phase | I | Reference | Comment |
---|---|---|---|---|
Capillary | DB-1 | 1657. | Peng, 2000 | 15. m/0.53 mm/1. μm, He; Program: 40C(3min) => 8C/min => 200(1min) => 5C/min => 300C(25min) |

Van Den Dool and Kratz RI, polar column, temperature ramp

Column type | Active phase | I | Reference | Comment |
---|---|---|---|---|
Capillary | DB-Wax | 1761. | Peng, 2000 | 15. m/0.53 mm/1. μm, He, 40. C @ 3. min, 5. K/min, 220. C @ 30. min |
Capillary | HP-Wax | 1760. | Peng, 2000 | 15. m/0.53 mm/1. μm, He, 40. C @ 3. min, 5. K/min, 220. C @ 30. min |

Normal alkane RI, non-polar column, temperature ramp

Column type | Active phase | I | Reference | Comment |
---|---|---|---|---|
Capillary | OV-101 | 1660. | Zenkevich, Eliseenkov, et al., 2011 | 25. m/0.20 mm/0.25 μm, Nitrogen, 6. K/min; Tstart: 40. C; Tend: 220. C |

Normal alkane RI, polar column, custom temperature program

Column type | Active phase | I | Reference | Comment |
---|---|---|---|---|
Capillary | DB-Wax | 1763. | Peng, Yang, et al., 1991 | Program: not specified |

References

Weast and Grasselli, 1989
CRC Handbook of Data on Organic Compounds, 2nd Editon, Weast,R.C and Grasselli, J.G., ed(s)., CRC Press, Inc., Boca Raton, FL, 1989, 1. [all data]
Devaney and Panian, 1953
Devaney, L.W.; Panian, G.W.,
Preparation and properties of some octyl ethers,
J. Am. Chem. Soc., 1953, 75, 4836-7. [all data]
Peng, 2000
Peng, C.T.,
Prediction of retention indices. V. Influence of electronic effects and column polarity on retention index,
J. Chromatogr. A, 2000, 903, 1-2, 117-143, https://doi.org/10.1016/S0021-9673(00)00901-8
. [all data]
Zenkevich, Eliseenkov, et al., 2011
Zenkevich, I.G.; Eliseenkov, E.V.; Kasatochkin, A.N.; Ukolov, A.I.,
Identification of the products of nonregioselective organic reactions by chromatography - mass spectrometry: chloro derivatives of dialkyl ethers,
Rus. J. Anal. Chem., 2011, 66, 14, 1445-1454, https://doi.org/10.1134/S1061934811140218
. [all data]
Peng, Yang, et al., 1991
Peng, C.T.; Yang, Z.C.; Ding, S.F.,
Prediction of rentention idexes. II. Structure-retention index relationship on polar columns,
J. Chromatogr., 1991, 586, 1, 85-112, https://doi.org/10.1016/0021-9673(91)80028-F
. [all data]