3-Amino-2-chloropyridine
- Formula: C5H5ClN2
- Molecular weight: 128.560
- IUPAC Standard InChIKey: MEQBJJUWDCYIAB-UHFFFAOYSA-N
- CAS Registry Number: 6298-19-7
- Chemical structure:
View 3d structure (requires JavaScript / HTML 5) - Other names: 3-Pyridinamine, 2-chloro-; Pyridine, 2-chloro-3-amino-; Pyridine, 3-amino-2-chloro-; 2-Chloro-3-aminopyridine; 2-Chloro-3-pyridinamine; 2-chloro-3-pyridylamine

Phase change data

Data compiled by: Robert L. Brown and Stephen E. Stein
Quantity | Value | Units | Method | Reference | Comment |
---|---|---|---|---|---|
Tfus | 353. | K | N/A | Buckingham and Donaghy, 1982 |
Reduced pressure boiling point
Tboil (K) | Pressure (bar) | Reference |
---|---|---|
405.2 | 0.017 | Weast and Grasselli, 1989 |
403. to 407. | 0.017 | Buckingham and Donaghy, 1982 |

References

Buckingham and Donaghy, 1982
Buckingham, J.; Donaghy, S.M.,
Dictionary of Organic Compounds: Fifth Edition, Chapman and Hall, New York, 1982, 1. [all data]
Weast and Grasselli, 1989
CRC Handbook of Data on Organic Compounds, 2nd Editon, Weast,R.C and Grasselli, J.G., ed(s)., CRC Press, Inc., Boca Raton, FL, 1989, 1. [all data]