Cetene
- Formula: C16H32
- Molecular weight: 224.4253
- IUPAC Standard InChIKey: GQEZCXVZFLOKMC-UHFFFAOYSA-N
- CAS Registry Number: 629-73-2
- Chemical structure:
View 3d structure (requires JavaScript / HTML 5) - Species with the same structure:
- Other names: 1-Hexadecene; α-Hexadecene; n-Hexadec-1-ene; 1-Cetene; Hexadecylene-1; Hexadec-1-ene; Hexadecene-1; Neodene 16; 1-n-Hexadecene; NSC 60602

Condensed phase thermochemistry data

Data compiled as indicated in comments:
ALS - Hussein Y. Afeefy, Joel F. Liebman, and Stephen E. Stein
DH - Eugene S. Domalski and Elizabeth D. Hearing
Quantity | Value | Units | Method | Reference | Comment |
---|---|---|---|---|---|
ΔfH°liquid | -330.5 ± 3.0 | kJ/mol | Ccr | Stridh, 1976 | ALS |
ΔfH°liquid | -327.3 ± 2.5 | kJ/mol | Ccb | Loeffler and Rossini, 1960 | Reanalyzed by Cox and Pilcher, 1970, Original value = -323.4 ± 3.3 kJ/mol; ALS |
ΔfH°liquid | -329.4 ± 2.1 | kJ/mol | Ccb | Fraser and Prosen, 1955 | ALS |
Quantity | Value | Units | Method | Reference | Comment |
ΔcH°liquid | -10539.0 ± 2.0 | kJ/mol | Ccr | Stridh, 1976 | Corresponding ΔfHºliquid = -330.4 kJ/mol (simple calculation by NIST; no Washburn corrections); ALS |
ΔcH°liquid | -10540. ± 2. | kJ/mol | Ccb | Fraser and Prosen, 1955 | Corresponding ΔfHºliquid = -329.2 kJ/mol (simple calculation by NIST; no Washburn corrections); ALS |
Quantity | Value | Units | Method | Reference | Comment |
S°liquid | 613.88 | J/mol*K | N/A | Messerly, Todd, et al., 1990 | DH |
S°liquid | 587.90 | J/mol*K | N/A | McCullough, Finke, et al., 1957 | Does not include S0.; DH |
Quantity | Value | Units | Method | Reference | Comment |
ΔcH°solid | -10546.0 ± 3.1 | kJ/mol | Ccb | Loeffler and Rossini, 1960 | Corresponding ΔfHºsolid = -323.43 kJ/mol (simple calculation by NIST; no Washburn corrections); ALS |
Constant pressure heat capacity of liquid
Cp,liquid (J/mol*K) | Temperature (K) | Reference | Comment |
---|---|---|---|
485.83 | 298.15 | Messerly, Todd, et al., 1990 | T = 10 to 400 K.; DH |
488.88 | 298.15 | McCullough, Finke, et al., 1957 | T = 11 to 360 K.; DH |

Phase change data

Data compiled as indicated in comments:
BS - Robert L. Brown and Stephen E. Stein
TRC - Thermodynamics Research Center, NIST Boulder Laboratories, Chris Muzny director
ALS - Hussein Y. Afeefy, Joel F. Liebman, and Stephen E. Stein
AC - William E. Acree, Jr., James S. Chickos
DH - Eugene S. Domalski and Elizabeth D. Hearing
CAL - James S. Chickos, William E. Acree, Jr., Joel F. Liebman, Students of Chem 202 (Introduction to the Literature of Chemistry), University of Missouri -- St. Louis
Quantity | Value | Units | Method | Reference | Comment |
---|---|---|---|---|---|
Tboil | 547.2 | K | N/A | Aldrich Chemical Company Inc., 1990 | BS |
Tboil | 547. | K | N/A | Farchan Laboratories, 1990 | BS |
Tboil | 557.6 | K | N/A | Weast and Grasselli, 1989 | BS |
Quantity | Value | Units | Method | Reference | Comment |
Tfus | 279. ± 8. | K | AVG | N/A | Average of 10 values; Individual data points |
Quantity | Value | Units | Method | Reference | Comment |
Ttriple | 277.390 | K | N/A | Messerly, Todd, et al., 1990, 2 | Crystal phase 1 phase; Uncertainty assigned by TRC = 0.003 K; TRC |
Ttriple | 277.51 | K | N/A | McCullough, Finke, et al., 1957, 2 | Uncertainty assigned by TRC = 0.05 K; TRC |
Ttriple | 277.30 | K | N/A | Waddington, 1951 | Uncertainty assigned by TRC = 0.15 K; TRC |
Ttriple | 277.45 | K | N/A | Waddington, 1951 | Uncertainty assigned by TRC = 0.05 K; TRC |
Quantity | Value | Units | Method | Reference | Comment |
ΔvapH° | 80.2 ± 0.2 | kJ/mol | AVG | N/A | Average of 6 values; Individual data points |
Enthalpy of vaporization
ΔvapH (kJ/mol) | Temperature (K) | Method | Reference | Comment |
---|---|---|---|---|
61.5 | 476. | A | Stephenson and Malanowski, 1987 | Based on data from 461. to 558. K. See also Camin, Forziati, et al., 1954.; AC |
Antoine Equation Parameters
log10(P) = A − (B / (T + C))
P = vapor pressure (bar)
T = temperature (K)
View plot Requires a JavaScript / HTML 5 canvas capable browser.
Temperature (K) | A | B | C | Reference | Comment |
---|---|---|---|---|---|
461.30 to 557.92 | 4.16208 | 1837.811 | -115.859 | Camin, Forziati, et al., 1954 | Coefficents calculated by NIST from author's data. |
Enthalpy of fusion
ΔfusH (kJ/mol) | Temperature (K) | Reference | Comment |
---|---|---|---|
30.192 | 277.51 | McCullough, Finke, et al., 1957 | DH |
30.21 | 277.5 | Messerly, Todd, et al., 1990 | AC |
Entropy of fusion
ΔfusS (J/mol*K) | Temperature (K) | Reference | Comment |
---|---|---|---|
108.80 | 277.51 | McCullough, Finke, et al., 1957 | DH |
Entropy of fusion
ΔfusS (J/mol*K) | Temperature (K) | Reference | Comment |
---|---|---|---|
15.53 | 249.2 | Messerly, Todd, et al., 1990, 3 | CAL |
108.86 | 277.5 |
Enthalpy of phase transition
ΔHtrs (kJ/mol) | Temperature (K) | Initial Phase | Final Phase | Reference | Comment |
---|---|---|---|---|---|
0.0 | 217.7 | crystaline, III | crystaline, II | Messerly, Todd, et al., 1990 | DH |
3.86957 | 249.2 | crystaline, II | crystaline, I | Messerly, Todd, et al., 1990 | DH |
30.09936 | 277.396 | crystaline, I | liquid | Messerly, Todd, et al., 1990 | DH |
Entropy of phase transition
ΔStrs (J/mol*K) | Temperature (K) | Initial Phase | Final Phase | Reference | Comment |
---|---|---|---|---|---|
15.53 | 249.2 | crystaline, II | crystaline, I | Messerly, Todd, et al., 1990 | DH |
108.51 | 277.396 | crystaline, I | liquid | Messerly, Todd, et al., 1990 | DH |

Gas phase thermochemistry data

Data compiled as indicated in comments:
ALS - Hussein Y. Afeefy, Joel F. Liebman, and Stephen E. Stein
DRB - Donald R. Burgess, Jr.
Quantity | Value | Units | Method | Reference | Comment |
---|---|---|---|---|---|
ΔfH°gas | -59.37 ± 0.60 | kcal/mol | Ccr | Stridh, 1976 | Reanalyzed by Pedley, Naylor, et al., 1986, Original value = -59.80 ± 0.72 kcal/mol; ALS |
ΔfH°gas | -59.09 ± 0.61 | kcal/mol | Ccb | Loeffler and Rossini, 1960 | Reanalyzed by Cox and Pilcher, 1970, Original value = -58.16 ± 0.79 kcal/mol; ALS |
ΔfH°gas | -59.58 | kcal/mol | N/A | Fraser and Prosen, 1955 | Value computed using ΔfHliquid° value of -329.4±2.1 kj/mol from Fraser and Prosen, 1955 and ΔvapH° value of 80.1 kj/mol from Loeffler and Rossini, 1960.; DRB |

Reaction thermochemistry data

Data compiled by: Hussein Y. Afeefy, Joel F. Liebman, and Stephen E. Stein
Individual Reactions
By formula: H2 + C16H32 = C16H34
Quantity | Value | Units | Method | Reference | Comment |
---|---|---|---|---|---|
ΔrH° | -29.60 ± 0.44 | kcal/mol | Chyd | Rogers and Skanupong, 1974 | liquid phase; solvent: Hexane |

Normal alkane RI, non-polar column, temperature ramp

Data compiled by: NIST Mass Spectrometry Data Center, William E. Wallace, director

Column type CapillaryCapillaryCapillaryCapillaryCapillary
Active phase HP-5 MSDB-5HP-101Petrocol DHHP-5
Column length (m) 30.30.25.150.25.
Carrier gas HeliumNitrogenHe He
Substrate
Column diameter (mm) 0.250.250.20.250.2
Phase thickness (μm) 0.250.250.21.00.33
Tstart (C) 70.40.70.40.60.
Tend (C) 290.230.200.300.240.
Heat rate (K/min) 5.2.3.1.3.
Initial hold (min)   2.
Final hold (min) 10. 15. 7.
I 1593.1590.1594.1590.1592.
ReferenceRadulovic, Blagojevic, et al., 2010Scrivanti, Anton, et al., 2009Mastelic, Jerkovic, et al., 2006Sojak, Kubinec, et al., 2006Duarte, Figueira, et al., 2005
Comment MSDC-RI MSDC-RI MSDC-RI MSDC-RI MSDC-RI
Column type CapillaryCapillaryCapillaryCapillaryCapillary
Active phase HP-5DB-5DB-5OV-1DB-1
Column length (m) 60.25.30.25.60.
Carrier gas HeHeHeH2
Substrate
Column diameter (mm) 0.320.250.250.310.32
Phase thickness (μm) 0.250.250.250.15
Tstart (C) 30.60.60.70.50.
Tend (C) 260.200.220.220.230.
Heat rate (K/min) 2.2.4.3.4.
Initial hold (min) 2. 5.
Final hold (min) 28.80.  10.
I 1593.21590.1590.1588.1590.
ReferenceLeffingwell and Alford, 2005Rout, Misra, et al., 2005Morteza-Semnani, Saeedi, et al., 2002Ramaroson-Raonizafinimanana, Gaydou, et al., 1997Binder and French, 1994
Comment MSDC-RI MSDC-RI MSDC-RI MSDC-RI MSDC-RI
Column type CapillaryCapillaryCapillaryCapillaryCapillary
Active phase Cross-Linked MethylsiliconeDB-1DB-1Ultra-1DB-1
Column length (m) 25.30.30.25.60.
Carrier gas HeHeHeHe
Substrate
Column diameter (mm) 0.320.250.250.320.32
Phase thickness (μm)  0.250.250.25
Tstart (C) 35.50.50.80.50.
Tend (C) 225.240.240.260.230.
Heat rate (K/min) 4.5.5.3.4.
Initial hold (min) 3.3.3.
Final hold (min)     10.
I 1590.1595.1600.1588.1586.
ReferenceBravo and Hotchkiss, 1993Shiota, 1993Shiota, 1993Okumura, 1991Binder, Benson, et al., 1990
Comment MSDC-RI MSDC-RI MSDC-RI MSDC-RI MSDC-RI
Column type CapillaryCapillaryCapillaryPacked
Active phase SE-54OV-101OV-101Apiezon L
Column length (m) 25.50.50.2.
Carrier gas  NitrogenNitrogen
Substrate    Chromosorb G-AW-DMCS
Column diameter (mm) 0.320.250.25
Phase thickness (μm)
Tstart (C) 100.70.80.25.
Tend (C) 280.200.200.
Heat rate (K/min) 2.2.2.10.
Initial hold (min)
Final hold (min)
I 1593.1590.1589.1597.
ReferenceScribe, Ngoumbi-Nzouzi, et al., 1990Sugisawa, Nakamura, et al., 1990Sugisawa, Nakamura, et al., 1990Dahlmann, Köser, et al., 1979
Comment MSDC-RI MSDC-RI MSDC-RI MSDC-RI

References

Stridh, 1976
Stridh, G.,
Enthalpies of formation of 1-dodecene and 1-hexadecene and the CH2-increment in the 1-alkene series,
J. Chem. Thermodyn., 1976, 8, 895-899. [all data]
Loeffler and Rossini, 1960
Loeffler, S.M.C.; Rossini, F.D.,
Heats of combustion and formation of the higher normal alkyl cyclopentanes, cyclohexanes, benzenes and 1-alkenes in the liquid state at 25°,
J. Phys. Chem., 1960, 64, 1530-1533. [all data]
Cox and Pilcher, 1970
Cox, J.D.; Pilcher, G.,
Thermochemistry of Organic and Organometallic Compounds, Academic Press, New York, 1970, 1-636. [all data]
Fraser and Prosen, 1955
Fraser, F.M.; Prosen, E.J.,
Heats of combustion of liquid n-hexadecane, 1-hexadecene, n-decylbenzene, n-decylcyclohexane, n-decylcyclopentane, and the variation of heat of combustion with chain length,
J. Res. NBS, 1955, 55, 329-333. [all data]
Messerly, Todd, et al., 1990
Messerly, J.F.; Todd, S.S.; Finke, H.L.; Lee-Bechtold, S.H.; Guthrie, G.B.; Steele, W.V.; Chirico, R.D.,
Heat capacities of pent-1-ene (10K to 320K), cis-hex-2-ene (10K to 330K), non-1-ene (10K to 400K), and hexadec-1-ene (10K to 400K),
J. Chem. Thermodynam., 1990, 22, 1107-1128. [all data]
McCullough, Finke, et al., 1957
McCullough, J.P.; Finke, H.L.; Gross, M.E.; Messerly, J.F.; Waddington, G.,
Low temperature calorimetric studies of seven 1-olefins: effect of orientational disorder in the solid state,
J. Phys. Chem., 1957, 61, 289-301. [all data]
Aldrich Chemical Company Inc., 1990
Aldrich Chemical Company Inc.,
Catalog Handbook of Fine Chemicals, Aldrich Chemical Company, Inc., Milwaukee WI, 1990, 1. [all data]
Farchan Laboratories, 1990
Farchan Laboratories,
Research Chemicals Catalog, Farchan Laboratories, Gainesville, FL, 1990, 91. [all data]
Weast and Grasselli, 1989
CRC Handbook of Data on Organic Compounds, 2nd Editon, Weast,R.C and Grasselli, J.G., ed(s)., CRC Press, Inc., Boca Raton, FL, 1989, 1. [all data]
Messerly, Todd, et al., 1990, 2
Messerly, J.F.; Todd, S.S.; Finke, H.L.; Lee-Bechtold, S.H.; Guthrie, G.B.; Steele, W.V.; Chirico, R.D.,
Heat capacities of pent-1-ene (10 K to 320 K), cis-hex-2-ene (10 K to 330 K), non-1-ene (10 K to 400 K) and hexadec-1-ene (10 K to 400 K),
J. Chem. Thermodyn., 1990, 22, 1107-28. [all data]
McCullough, Finke, et al., 1957, 2
McCullough, J.P.; Finke, H.L.; Gross, M.E.; Messerly, J.F.; Waddington, G.,
Low temperature calorimetric studies of seven 1-olefins: effect of orientational disorder in the solid state,
J. Phys. Chem., 1957, 61, 289. [all data]
Waddington, 1951
Waddington, G.,
Personal Commun., U. S. Bur. Mines, Bartlesville, OK, 1951. [all data]
Stephenson and Malanowski, 1987
Stephenson, Richard M.; Malanowski, Stanislaw,
Handbook of the Thermodynamics of Organic Compounds, 1987, https://doi.org/10.1007/978-94-009-3173-2
. [all data]
Camin, Forziati, et al., 1954
Camin, David L.; Forziati, Alphonse F.; Rossini, Frederick D.,
Physical Properties of n-Hexadecane, n-Decylcyclopentane, n-Decylcyclohexane, 1-Hexadecene and n-Decylbenzene,
J. Phys. Chem., 1954, 58, 5, 440-442, https://doi.org/10.1021/j150515a015
. [all data]
Messerly, Todd, et al., 1990, 3
Messerly, J.F.; Todd, S.S.; Finke, H.L.; Lee-Bechtold, S.H.; Guthrie, G.B.; Steele, W.V.; Chirico, R.D.,
Heat capacities of pent-1-ene (10 K to 320 K), cis-hex-2-ene (10 K to 330 K), non-1-ene (10 K to 400 K), and hexadec-1-ene (10 K to 400 K),
J. Chem. Thermodyn., 1990, 22, 11, 1107, https://doi.org/10.1016/0021-9614(90)90159-N
. [all data]