Heptane, 1,1'-thiobis-

Kovats' RI, non-polar column, isothermal

Data compiled by: NIST Mass Spectrometry Data Center, William E. Wallace, director

Column type PackedPacked
Active phase SE-30SE-30
Column length (m) 1.81.
Carrier gas N2N2
Substrate Chromaton N-AWHMDSChromaton N-AW-DMCS
Column diameter (mm)
Phase thickness (μm)
Temperature (C) 80.190.
I 1674.1696.
ReferenceZotov, Golovkin, et al., 1981Golovkin, Smol'chenko, et al., 1980
Comment MSDC-RI MSDC-RI

References

Zotov, Golovkin, et al., 1981
Zotov, L.N.; Golovkin, G.V.; Golovnya, R.V., GC Behaviour of Symmetrical n-Dialkyl Sulphides under Isothermal and Temperature Programming Conditions, J. Hi. Res. Chromatogr. Chromatogr. Comm., 1981, 4, 1, 6-10, https://doi.org/10.1002/jhrc.1240040103 . [all data]

Golovkin, Smol'chenko, et al., 1980
Golovkin, G.V.; Smol'chenko, A.I.; Zotov, L.N.; Sazonov, S.E., Systems of gas-chromatographic retention indices for identifying pesticides by means of selective detectors, Zh. Anal. Khim., 1980, 35, 5, 651-655. [all data]