Acetonitrile, ethoxy-
- Formula: C4H7NO
- Molecular weight: 85.1045
- IUPAC Standard InChIKey: WPYUCWSMVJJWFI-UHFFFAOYSA-N
- CAS Registry Number: 62957-60-2
- Chemical structure:
View 3d structure (requires JavaScript / HTML 5) - Other names: Ethoxyacetonitrile

Gas phase thermochemistry data

Data compiled by: Hussein Y. Afeefy, Joel F. Liebman, and Stephen E. Stein
Quantity | Value | Units | Method | Reference | Comment |
---|---|---|---|---|---|
ΔfH°gas | -69.50 ± 0.56 | kJ/mol | Ccb | Verevkin, Beckhaus, et al., 1995 |

Condensed phase thermochemistry data

Data compiled by: Hussein Y. Afeefy, Joel F. Liebman, and Stephen E. Stein
Quantity | Value | Units | Method | Reference | Comment |
---|---|---|---|---|---|
ΔfH°liquid | -116.0 ± 0.5 | kJ/mol | Ccb | Verevkin, Beckhaus, et al., 1995 | |
ΔfH°liquid | -111.7 ± 0.6 | kJ/mol | Ccb | Gutner, Lebedeva, et al., 1980 | |
Quantity | Value | Units | Method | Reference | Comment |
ΔcH°liquid | -2458.5 ± 0.4 | kJ/mol | Ccb | Verevkin, Beckhaus, et al., 1995 | |
ΔcH°liquid | -2462.7 ± 0.6 | kJ/mol | Ccb | Gutner, Lebedeva, et al., 1980 |

Phase change data

Data compiled as indicated in comments:
ALS - Hussein Y. Afeefy, Joel F. Liebman, and Stephen E. Stein
AC - William E. Acree, Jr., James S. Chickos
Quantity | Value | Units | Method | Reference | Comment |
---|---|---|---|---|---|
ΔvapH° | 46.48 ± 0.25 | kJ/mol | V | Verevkin, Beckhaus, et al., 1995 | ALS |
ΔvapH° | 46.5 ± 0.3 | kJ/mol | GS | Verevkin, Beckhaus, et al., 1995 | Based on data from 273. to 313. K.; AC |

References

Verevkin, Beckhaus, et al., 1995
Verevkin, S.P.; Beckhaus, H.-D.; Ruchardt, C.,
Geminale substituenteneffekte. Teil 6. Standardbildungsenthalpien von alkylsubstituierten-alkoxynitrilen und α-cyano-carbonsaureestern,
Thermochim. Acta, 1995, 249, 1-11. [all data]
Gutner, Lebedeva, et al., 1980
Gutner, N.M.; Lebedeva, N.D.; Dobychin, S.L.; Kiseleva, N.N.,
Thermochemical study of aliphatic ethers,
J. Appl. Chem. USSR, 1980, 53, 1523-1525. [all data]