bicyclo[2.2.1]heptane-1-methanol, α-methyl-
- Formula: C9H16O
- Molecular weight: 140.2227
- IUPAC Standard InChIKey: OJSGRLRPALLGRM-UHFFFAOYSA-N
- CAS Registry Number: 62947-53-9
- Chemical structure:
View 3d structure (requires JavaScript / HTML 5) - Permanent link for this species. Use this link for bookmarking this species for future reference.

Phase change data

Data compiled by: Thermodynamics Research Center, NIST Boulder Laboratories, Chris Muzny director
Quantity | Value | Units | Method | Reference | Comment |
---|---|---|---|---|---|
Tfus | 263. | K | N/A | Anonymous, 1954 | Uncertainty assigned by TRC = 0.6 K |

References

Anonymous, 1954
Anonymous, R.,
, Am. Pet. Inst. Res. Proj. 45, Tech. Rep. 13, Ohio State Univ., 1954. [all data]