1,3,5,7-Cyclooctatetraene
- Formula: C8H8
- Molecular weight: 104.1491
- IUPAC Standard InChIKey: KDUIUFJBNGTBMD-BONZMOEMSA-N
- CAS Registry Number: 629-20-9
- Chemical structure:
View 3d structure (requires JavaScript / HTML 5) - Other names: [8]Annulene; Cyclooctatetraene; UN 2358

Gas phase thermochemistry data

Data compiled as indicated in comments:
DRB - Donald R. Burgess, Jr.
GT - Glushko Thermocenter, Russian Academy of Sciences, Moscow
Quantity | Value | Units | Method | Reference | Comment |
---|---|---|---|---|---|
ΔfH°gas | 297.6 ± 1.3 | kJ/mol | N/A | Prosen, Johnson, et al., 1950 | Value computed using ΔfHliquid° value of 254.5±1.3 kj/mol from Prosen, Johnson, et al., 1950 and ΔvapH° value of 43.1±0.31 kj/mol from missing citation.; DRB |
Quantity | Value | Units | Method | Reference | Comment |
S°gas | 326.8 ± 1.5 | J/mol*K | N/A | Scott D.W., 1949 | GT |
Constant pressure heat capacity of gas
Cp,gas (J/mol*K) | Temperature (K) | Reference | Comment |
---|---|---|---|
35.83 | 50. | Dorofeeva O.V., 1986 | Selected values of Cp(T) are in close agreement with those calculated by [ Lippincott E.R., 1951], while the S(T) values are 1.5-2.0 J/mol*K larger than obtained by [ Lippincott E.R., 1951].; GT |
50.68 | 100. | ||
66.51 | 150. | ||
83.80 | 200. | ||
112.48 | 273.15 | ||
122.6 ± 3.5 | 298.15 | ||
123.36 | 300. | ||
161.83 | 400. | ||
194.41 | 500. | ||
220.96 | 600. | ||
242.65 | 700. | ||
260.63 | 800. | ||
275.70 | 900. | ||
288.44 | 1000. | ||
299.29 | 1100. | ||
308.55 | 1200. | ||
316.50 | 1300. | ||
323.34 | 1400. | ||
329.26 | 1500. |

Condensed phase thermochemistry data

Data compiled as indicated in comments:
ALS - Hussein Y. Afeefy, Joel F. Liebman, and Stephen E. Stein
DH - Eugene S. Domalski and Elizabeth D. Hearing
Quantity | Value | Units | Method | Reference | Comment |
---|---|---|---|---|---|
ΔfH°liquid | 254.5 ± 1.3 | kJ/mol | Cm | Prosen, Johnson, et al., 1950 | ALS |
Quantity | Value | Units | Method | Reference | Comment |
ΔcH°liquid | -4539. ± 3. | kJ/mol | Ccb | Springall, White, et al., 1954 | Corresponding ΔfHºliquid = 248. kJ/mol (simple calculation by NIST; no Washburn corrections); ALS |
ΔcH°liquid | -4545.92 ± 0.92 | kJ/mol | Cm | Prosen, Johnson, et al., 1950 | Corresponding ΔfHºliquid = 254.5 kJ/mol (simple calculation by NIST; no Washburn corrections); ALS |
Quantity | Value | Units | Method | Reference | Comment |
S°liquid | 220.29 | J/mol*K | N/A | Scott, Gross, et al., 1949 | DH |
Constant pressure heat capacity of liquid
Cp,liquid (J/mol*K) | Temperature (K) | Reference | Comment |
---|---|---|---|
185.18 | 298.15 | Scott, Gross, et al., 1949 | T = 12 to 340 K.; DH |

Phase change data

Data compiled as indicated in comments:
BS - Robert L. Brown and Stephen E. Stein
TRC - Thermodynamics Research Center, NIST Boulder Laboratories, Chris Muzny director
ALS - Hussein Y. Afeefy, Joel F. Liebman, and Stephen E. Stein
AC - William E. Acree, Jr., James S. Chickos
DH - Eugene S. Domalski and Elizabeth D. Hearing
Quantity | Value | Units | Method | Reference | Comment |
---|---|---|---|---|---|
Tboil | 415.7 | K | N/A | Aldrich Chemical Company Inc., 1990 | BS |
Tboil | 416. | K | N/A | Reppe, Schlichting, et al., 1948 | Uncertainty assigned by TRC = 4. K; TRC |
Quantity | Value | Units | Method | Reference | Comment |
Tfus | 265.0 | K | N/A | Cope and Bailey, 1948 | Uncertainty assigned by TRC = 1.5 K; TRC |
Tfus | 266. | K | N/A | Reppe, Schlichting, et al., 1948 | Uncertainty assigned by TRC = 3. K; TRC |
Quantity | Value | Units | Method | Reference | Comment |
Ttriple | 268.48 | K | N/A | Scott, Gross, et al., 1949, 2 | Uncertainty assigned by TRC = 0.01 K; TRC |
Quantity | Value | Units | Method | Reference | Comment |
ΔvapH° | 43.1 ± 0.31 | kJ/mol | V | Scott, Gross, et al., 1949, 3 | ALS |
ΔvapH° | 43.1 | kJ/mol | N/A | Scott, Gross, et al., 1949 | AC |
Enthalpy of vaporization
ΔvapH (kJ/mol) | Temperature (K) | Method | Reference | Comment |
---|---|---|---|---|
43.9 | 288. | A | Stephenson and Malanowski, 1987 | Based on data from 273. to 348. K.; AC |
Antoine Equation Parameters
log10(P) = A − (B / (T + C))
P = vapor pressure (bar)
T = temperature (K)
View plot Requires a JavaScript / HTML 5 canvas capable browser.
Temperature (K) | A | B | C | Reference | Comment |
---|---|---|---|---|---|
273. to 348. | 3.9958 | 1402.263 | -63.521 | Scott, Gross, et al., 1949 | Coefficents calculated by NIST from author's data. |
Enthalpy of fusion
ΔfusH (kJ/mol) | Temperature (K) | Reference | Comment |
---|---|---|---|
11.2742 | 268.48 | Scott, Gross, et al., 1949 | DH |
11.25 | 268.5 | Domalski and Hearing, 1996 | AC |
Entropy of fusion
ΔfusS (J/mol*K) | Temperature (K) | Reference | Comment |
---|---|---|---|
41.493 | 268.48 | Scott, Gross, et al., 1949 | DH |

Kovats' RI, non-polar column, isothermal

Column type | Active phase | Temperature (C) | I | Reference | Comment |
---|---|---|---|---|---|
Capillary | Squalane | 70. | 850. | Schomburg, 1966 |

Van Den Dool and Kratz RI, non-polar column, temperature ramp

Column type | Active phase | I | Reference | Comment |
---|---|---|---|---|
Packed | SE-30 | 880. | Buchman, Cao, et al., 1984 | He, Chromosorb AW, 40. C @ 10. min, 10. K/min, 210. C @ 30. min; Column length: 3.05 m |

Van Den Dool and Kratz RI, non-polar column, custom temperature program

Column type | Active phase | I | Reference | Comment |
---|---|---|---|---|
Packed | SE-30 | 880. | Peng, Ding, et al., 1988 | Supelcoport; Chromosorb; Column length: 3.05 m; Program: 40C(5min) => 10C/min => 200C or 250C (60min) |

Van Den Dool and Kratz RI, polar column, temperature ramp

Column type | Active phase | I | Reference | Comment |
---|---|---|---|---|
Capillary | Carbowax 20M | 1244. | Verzera, Campisi, et al., 2005 | 60. m/0.25 mm/0.25 μm, He, 45. C @ 0.17 min, 2. K/min; Tend: 250. C |
Capillary | CP-Wax 52CB | 1244. | Verzera, Campisi, et al., 2001 | 60. m/0.25 mm/0.25 μm, He, 45. C @ 0.17 min, 2. K/min; Tend: 250. C |
Capillary | DB-Wax | 1264. | Shimoda, Peralta, et al., 1996 | 60. m/0.25 mm/0.25 μm, He, 3. K/min; Tstart: 50. C; Tend: 230. C |
Packed | Carbowax 20M | 1226. | Buchman, Cao, et al., 1984 | He, Supelcoport, 40. C @ 10. min, 10. K/min, 210. C @ 30. min; Column length: 3.05 m |

Normal alkane RI, non-polar column, temperature ramp

Column type | Active phase | I | Reference | Comment |
---|---|---|---|---|
Capillary | CP Sil 8 CB | 894. | Wang and Guo-Y. -L., 2004 | 30. m/0.25 mm/0.25 μm, He, 50. C @ 3. min, 10. K/min, 200. C @ 2. min |

Normal alkane RI, non-polar column, custom temperature program

Column type | Active phase | I | Reference | Comment |
---|---|---|---|---|
Capillary | Squalane | 850. | Chen, 2008 | Program: not specified |
Capillary | OV-1, SE-30, Methyl silicone, SP-2100, OV-101, DB-1, etc. | 880. | Waggott and Davies, 1984 | Hydrogen; Column length: 50. m; Column diameter: 0.32 mm; Program: not specified |
Packed | SE-30 | 889. | Robinson and Odell, 1971 | N2, Chromosorb W; Column length: 6.1 m; Program: 50C910min) => 20C/min => 90(6min) => 10C/min => 150C(hold) |
Packed | Squalane | 846. | Robinson and Odell, 1971 | N2, Embacel; Column length: 3.0 m; Program: 25C(5min) => 2C/min => 35 => 4C/min => 95C(hold) |

Normal alkane RI, polar column, custom temperature program

Column type | Active phase | I | Reference | Comment |
---|---|---|---|---|
Capillary | Carbowax 20M | 1244. | Editorial paper, 2005 | Program: not specified |
Capillary | DB-Wax | 1199. | Peng, Yang, et al., 1991 | Program: not specified |
Capillary | Carbowax 400, Carbowax 20M, Carbowax 1540, Carbowax 4000, Superox 06, PEG 20M, etc. | 1226. | Waggott and Davies, 1984 | Hydrogen; Column length: 50. m; Column diameter: 0.32 mm; Program: not specified |

Gas phase ion energetics data

Data compiled as indicated in comments:
B - John E. Bartmess
LLK - Sharon G. Lias, Rhoda D. Levin, and Sherif A. Kafafi
RDSH - Henry M. Rosenstock, Keith Draxl, Bruce W. Steiner, and John T. Herron
LBLHLM - Sharon G. Lias, John E. Bartmess, Joel F. Liebman, John L. Holmes, Rhoda D. Levin, and W. Gary Mallard
Electron affinity determinations
EA (eV) | Method | Reference | Comment |
---|---|---|---|
0.570 ± 0.030 | N/A | Miller, Viggiano, et al., 2002 | B |
0.550 ± 0.020 | IMRE | Kato, Lee, et al., 1997 | B |
0.650 ± 0.043 | LPES | Wenthold, Hrovat, et al., 1996 | EA(D4h COT) = 1.099 ± 0.01 eV. D4H is TS, 10-11 kcal/mol above GS D8h; B |
0.58 ± 0.10 | CIDC | Denault, Chen, et al., 1998 | entropy of attachment: -14.7±13 eu; B |
<0.823919 | PD | Gygax, Peters, et al., 1979 | B |
0.577 ± 0.043 | ECD | Wentworth and Ristau, 1969 | B |
Ionization energy determinations
IE (eV) | Method | Reference | Comment |
---|---|---|---|
8.03 | PE | Fu and Dunbar, 1978 | LLK |
8.0 | PE | Batich, Bischof, et al., 1973 | LLK |
8.21 | PE | Dewar, Harget, et al., 1969 | Unpublished result of M.J.S. Dewar and S.D. Worley; RDSH |
8.04 | PE | Al-Joboury and Turner, 1964 | RDSH |
7.99 ± 0.02 | PI | Watanabe, Nakayama, et al., 1962 | RDSH |
8.43 | PE | Fu and Dunbar, 1978 | Vertical value; LLK |
Appearance energy determinations
Ion | AE (eV) | Other Products | Method | Reference | Comment |
---|---|---|---|---|---|
C3H3+ | 13.40 ± 0.10 | ? | EI | Franklin and Carroll, 1969 | RDSH |
C4H2+ | 17.11 ± 0.10 | 2C2H2+H2 | EI | Franklin and Carroll, 1969 | RDSH |
C4H3+ | 18.16 ± 0.25 | 2C2H2+H | EI | Franklin and Carroll, 1969 | RDSH |
C4H4+ | 15.10 ± 0.10 | 2C2H2 | EI | Franklin and Carroll, 1969 | RDSH |
C5H3+ | 16.41 ± 0.15 | C2H2+CH3? | EI | Franklin and Carroll, 1969 | RDSH |
C6H5+ | 14.58 ± 0.10 | C2H2+H | EI | Franklin and Carroll, 1969 | RDSH |
C6H6+ | 9.4 ± 0.05 | C2H2 | TRPI | Lifshitz and Malinovich, 1984 | LBLHLM |
C6H6+ | 9.70 ± 0.12 | C2H2 | EI | Franklin and Carroll, 1969 | RDSH |
C8H6+ | 11.70 ± 0.10 | H2 | EI | Franklin and Carroll, 1969 | RDSH |
C8H7+ | 10.90 ± 0.10 | H | EI | Franklin and Carroll, 1969 | RDSH |
De-protonation reactions
C8H7- + =
Quantity | Value | Units | Method | Reference | Comment |
---|---|---|---|---|---|
ΔrH° | 1601. ± 12. | kJ/mol | G+TS | Kato, Lee, et al., 1997 | gas phase; B |
Quantity | Value | Units | Method | Reference | Comment |
ΔrG° | 1568. ± 10. | kJ/mol | IMRE | Kato, Lee, et al., 1997 | gas phase; B |

Reaction thermochemistry data

Data compiled as indicated in comments:
B - John E. Bartmess
ALS - Hussein Y. Afeefy, Joel F. Liebman, and Stephen E. Stein
Individual Reactions
C8H7- + =
Quantity | Value | Units | Method | Reference | Comment |
---|---|---|---|---|---|
ΔrH° | 382.7 ± 2.8 | kcal/mol | G+TS | Kato, Lee, et al., 1997 | gas phase; B |
Quantity | Value | Units | Method | Reference | Comment |
ΔrG° | 374.8 ± 2.5 | kcal/mol | IMRE | Kato, Lee, et al., 1997 | gas phase; B |
By formula: 4H2 + C8H8 = C8H16
Quantity | Value | Units | Method | Reference | Comment |
---|---|---|---|---|---|
ΔrH° | -97.96 ± 0.05 | kcal/mol | Chyd | Turner, Meador, et al., 1957 | liquid phase; solvent: Acetic acid; ALS |
By formula: C8H8 = C8H8
Quantity | Value | Units | Method | Reference | Comment |
---|---|---|---|---|---|
ΔrH° | -34.35 ± 0.34 | kcal/mol | Ciso | Prosen, Johnson, et al., 1947 | liquid phase; ALS |
By formula: C8H8 = c8H8
Quantity | Value | Units | Method | Reference | Comment |
---|---|---|---|---|---|
ΔrH° | 5.5 ± 0.6 | kcal/mol | Eqk | Squillacote and Bergman, 1986 | gas phase; ALS |

References

Prosen, Johnson, et al., 1950
Prosen, E.J.; Johnson, W.H.; Rossini, F.D.,
Heat of combustion and formation of 1,3,5,7-cyclooctatetraene and its heat of isomerization of styrene,
J. Am. Chem. Soc., 1950, 72, 626-629. [all data]
Scott D.W., 1949
Scott D.W.,
Cyclooctatetraene: low-temperature heat capacity, heat of fusion, heat of vaporization, vapor pressure, and entropy,
J. Am. Chem. Soc., 1949, 71, 1634-1636. [all data]
Dorofeeva O.V., 1986
Dorofeeva O.V.,
Thermodynamic properties of twenty-one monocyclic hydrocarbons,
J. Phys. Chem. Ref. Data, 1986, 15, 437-464. [all data]
Lippincott E.R., 1951
Lippincott E.R.,
The thermodynamic functions of cyclooctatetraene,
J. Am. Chem. Soc., 1951, 73, 3889-3891. [all data]
Springall, White, et al., 1954
Springall, H.D.; White, T.R.; Cass, R.C.,
Heats of combustion and molecular structure Part 1.- The resonance energy and structure of cyclo-octateraene,
Trans. Faraday Soc., 1954, 50, 815. [all data]
Scott, Gross, et al., 1949
Scott, D.W.; Gross, M.E.; Oliver, G.D.; Huffman, H.M.,
Cycloöctatetraene: low-temperature heat capacity, heat of fusion, heat of vaporization, vapor pressure and entropy,
J. Am. Chem. Soc., 1949, 71, 1634-1636. [all data]
Aldrich Chemical Company Inc., 1990
Aldrich Chemical Company Inc.,
Catalog Handbook of Fine Chemicals, Aldrich Chemical Company, Inc., Milwaukee WI, 1990, 1. [all data]
Reppe, Schlichting, et al., 1948
Reppe, W.; Schlichting, O.; Klager, K.; Toepel, T.,
Cyclizing Polymerization of Acetylene I. Cyclooctatetraene,
Justus Liebigs Ann. Chem., 1948, 560, 1-92. [all data]
Cope and Bailey, 1948
Cope, A.C.; Bailey, W.J.,
Cyclic Polyolefins II. Synthesis of Cyclooctatetraene from Chloroprene,
J. Am. Chem. Soc., 1948, 70, 2305. [all data]
Scott, Gross, et al., 1949, 2
Scott, D.W.; Gross, M.E.; Oliver, G.D.; Huffman, H.M.,
Cyclooctatetraene: low-temperature heat capacity, heat of fusion, heat of vaporization, vapor pressure and entropy,
J. Am. Chem. Soc., 1949, 71, 1634. [all data]
Scott, Gross, et al., 1949, 3
Scott, D.W.; Gross, M.E.; Oliver, G.D.; Huffman, H.M.,
Cyclooctatetraene: Low-temperature heat capacity, heat of fusion, heat of vaporization, vapor pressure and entropy,
J. Am. Chem. Soc., 1949, 71, 1634-16. [all data]
Stephenson and Malanowski, 1987
Stephenson, Richard M.; Malanowski, Stanislaw,
Handbook of the Thermodynamics of Organic Compounds, 1987, https://doi.org/10.1007/978-94-009-3173-2
. [all data]
Domalski and Hearing, 1996
Domalski, Eugene S.; Hearing, Elizabeth D.,
Heat Capacities and Entropies of Organic Compounds in the Condensed Phase. Volume III,
J. Phys. Chem. Ref. Data, 1996, 25, 1, 1, https://doi.org/10.1063/1.555985
. [all data]